Package Base Details: util-linux-aes

Git Clone URL: https://aur.archlinux.org/util-linux-aes.git (read-only, click to copy)
Submitter: None
Maintainer: TrialnError
Last Packager: TrialnError
Votes: 5
Popularity: 0.000000
First Submitted: 2011-03-02 21:16
Last Updated: 2020-01-12 20:03

Latest Comments

« First ‹ Previous 1 2 3 4 Next › Last »

sysfu commented on 2012-11-21 23:30

My first attempt at building the package was by running "yaourt -S util-linux-aes". I did not run it as root however. I will try that and see if it resolves the issues, however I am skeptical that it will because my understanding is that yaourt automatically elevates privileges to root as required.

xerc commented on 2012-11-21 23:27

https://wiki.archlinux.de/title/Yaourt
# yaourt -S util-linux-aes

xerc commented on 2012-11-21 20:39

have you testet ..
# yaourt -S util-linux-aes

sysfu commented on 2012-11-21 06:49

makepkg build keeps choking after one of the linux regression tests fails:

: ext2 ... FAILED (blkid/low-probe-ext2)

<snip>
---------------------------------------------------------------------
1 tests of 86 FAILED
---------------------------------------------------------------------
make[3]: *** [check-local-tests] Error 1
make[3]: Leaving directory `/home/seth/Downloads/util-linux-aes/src/util-linux-2.22'
make[2]: *** [check-am] Error 2
make[2]: Leaving directory `/home/seth/Downloads/util-linux-aes/src/util-linux-2.22'
make[1]: *** [check-recursive] Error 1
make[1]: Leaving directory `/home/seth/Downloads/util-linux-aes/src/util-linux-2.22'
make: *** [check] Error 2
make: Leaving directory `/home/seth/Downloads/util-linux-aes/src/util-linux-2.22'
==> ERROR: A failure occurred in check().
Aborting...

xerc commented on 2012-07-21 14:52

new version configured with --enable-login-utils to serve <login>

Anonymous comment on 2012-07-20 22:09

Update by coincidence (debugging something else) i learned agetty runs /bin/login
So i just copy the vanilla login from core/util-linux for now.

Anonymous comment on 2012-07-18 21:11

I can't get agetty to log me in.
There are odder means to login so its just a minor nuisance ;)

pacman -Qo /sbin/agetty
/sbin/agetty is owned by util-linux-aes 2.21.2-2

When i enter the login name it never asks for the password.
Don't know where the error is just a bug report.

xerc commented on 2012-05-01 16:34

till now, there is no loop-AES patch - have to wait some hours/days

Anonymous comment on 2012-05-01 16:10

version 2.21.1-2 out since apr, 6th.
sorry for marking outdated but the new version is a precondition to pacman itself... :P

xerc commented on 2012-03-02 22:18

i'm not sure what causes this - the new version may fix your problem