Package Base Details: tuxguitar

Git Clone URL: (read-only, click to copy)
Submitter: Barthalion
Maintainer: buzo
Last Packager: buzo
Votes: 47
Popularity: 1.33
First Submitted: 2018-01-05 17:06
Last Updated: 2021-05-10 16:53

Pinned Comments

buzo commented on 2020-06-07 11:11

The easiest way to solve build failures is by building in a clean chroot. Else make sure with archlinux-java status that you are not using an old Java version. To use the latest Java varsion, run archlinux-java set java-14-openjdk.

Latest Comments

« First ‹ Previous 1 2 3 4 5 6 7 Next › Last »

buzo commented on 2019-07-10 15:50

LeonardK: I tried that first, too, but it didn't work. Pacman installed two Java versions in the chroot: 12 for the first dependency and 11 for the second one. Then I still got that build error.

It turns out that this is a known pacman bug.

ljrk commented on 2019-07-10 15:28

I'd rather prefer to have the dependency listed as :

'java-environment>=8' 'java-environment<12'

as described in

This allows for different java editions to be used than OpenJDK and different versions than 11.

buzo commented on 2019-07-10 11:22

andmars: Thanks for the notice, should be fixed now.

andmars commented on 2019-07-09 13:37

[INFO] BUILD FAILURE [INFO] ------------------------------------------------------------------------ [INFO] Total time: 4.236 s [INFO] Finished at: 2019-07-09T15:36:44+02:00 [INFO] ------------------------------------------------------------------------ [ERROR] Failed to execute goal org.apache.maven.plugins:maven-compiler-plugin:2.3.2:compile (default-compile) on project tuxguitar-lib: Compilation failure: Compilation failure: [ERROR] error: Source option 6 is no longer supported. Use 7 or later. [ERROR] error: Target option 6 is no longer supported. Use 7 or later. [ERROR] -> [Help 1] [ERROR] [ERROR] To see the full stack trace of the errors, re-run Maven with the -e switch. [ERROR] Re-run Maven using the -X switch to enable full debug logging. [ERROR] [ERROR] For more information about the errors and possible solutions, please read the following articles: [ERROR] [Help 1] ==> FEHLER: Ein Fehler geschah in build(). Breche ab...

raith commented on 2019-04-29 12:06

@rigczTheSky This is not a problem with this package. Please update your system and retry installing this package. From your comment I take, that pacman wants to install a version of apr that is outdated since at least 3 weeks (fluidsynth is outdated as well).

As a general tip for the future to prevent this kind of problem: Update your Arch Linux/Antergos/etc. at least once a week.

ThanosApostolou commented on 2019-04-28 21:09

I no longer have time to maintain this package, so I disown it. Please someone take over.

rigczTheSky commented on 2019-04-28 21:08

When i was trying to install then i've got an error:

Downloading apr (1.6.5-1-x86_64)... Downloading fluidsynth (2.0.4-1-x86_64)... Warning: failed to retrieve some files Downloading apr (1.6.5-1-x86_64)... Warning: failed to retrieve some files Failed to commit transaction: failed retrieving file 'apr-1.6.5-1-x86_64.pkg.tar.xz' from : The requested URL returned error: 404 Not Found

I am using Antergos with XFCE. I would be thankfull for Your help.

ThanosApostolou commented on 2019-03-20 12:43

@Popolon maven is listed as a makedepend and it builds fine in a clean chroot. What dependency do you mean?

Popolon commented on 2019-03-20 10:56

A build dependency with maven package is missing.

ThanosApostolou commented on 2019-03-19 22:11

I updated tuxguitar to the latest commit in order to resolve the issues. I tested it and it works fine. Tell me if you have any problems.