Package Base Details: sqlitestudio

Git Clone URL: https://aur.archlinux.org/sqlitestudio.git (read-only)
Submitter: dracorp
Maintainer: dracorp
Last Packager: dracorp
Votes: 13
Popularity: 0.005897
First Submitted: 2012-11-22 08:28
Last Updated: 2018-08-29 16:33

Latest Comments

« First ‹ Previous 1 2 3 4 5 Next › Last »

dracorp commented on 2016-09-24 21:15

@ijann: fixed.

dracorp commented on 2016-09-24 15:29

@ijann Use LC_ALL=C foo_command for the future.

ijann commented on 2016-09-23 15:15

I use to install this

$ git clone https://aur.archlinux.org/sqlitestudio.git
$ cd sqlitestudio
$ makepkg -cCifs

With the manager pacman is equal
I jump this error

In file included from /usr/include/c++/6.2.1/bits/stl_algo.h:59:0,
from /usr/include/c++/6.2.1/algorithm:62,
from /usr/include/qt/QtCore/qglobal.h:94,
from ../../../../Plugins/ScriptingTcl/scriptingtcl_global.h:4,
from ../../../../Plugins/ScriptingTcl/scriptingtcl.h:4,
from ../../../../Plugins/ScriptingTcl/scriptingtcl.cpp:1:
/usr/include/c++/6.2.1/cstdlib:75:25: error fatal: stdlib.h: No existe el fichero o el directorio
#include_next <stdlib.h>
^
compilación terminada.
make[1]: *** [Makefile:486: ../../../build/scriptingtcl.o] Error 1
make[1]: se sale del directorio '/home/xxxxxx/Download/sqlitestudio/src/output/build/Plugins/ScriptingTcl'

make: *** [Makefile:383: sub-ScriptingTcl-make_first] Error 2
==> ERROR: Se produjo un fallo en build().
Cancelando…

goetzc commented on 2016-09-08 22:34

Please remove the install file as those updates are now handled by pacman hooks.

dracorp commented on 2016-09-01 19:55

@rkelly: Which provides?
https://wiki.archlinux.org/index.php/PKGBUILD#provides
"Do not add pkgname to the provides array, as it is done automatically."

rkelly commented on 2016-09-01 18:51

This package conflicts with existing sqlitestudio installations (for example, sqlitestudio-bin which is no longer in the AUR). Perhaps it needs a provides statement?

dracorp commented on 2016-06-13 21:42

@olsonpm
Fixed PKGBUILD and also splited package to sqlitestudio and sqlitestudio-plugins.

dracorp commented on 2016-06-12 05:49

I have same error for 3.1.0

dracorp commented on 2016-06-12 05:26

But cstdlib and stdlib.h belong to gcc (or gcc-multilib). Could you reinstall this package(s)?

olsonpm commented on 2016-06-11 18:14

I'm not familiar with C or makefiles, and the few hints I got from the web didn't help me resolve the following build error:

/usr/include/c++/6.1.1/cstdlib:75:25: fatal error: stdlib.h: No such file or directory
#include_next <stdlib.h>
^
compilation terminated.
Makefile:608: recipe for target '../../../build/scriptingtcl.o' failed
make[1]: *** [../../../build/scriptingtcl.o] Error 1
make[1]: Leaving directory '/tmp/yaourt-tmp-phil/aur-sqlitestudio/src/output/build/Plugins/ScriptingTcl'
Makefile:381: recipe for target 'sub-ScriptingTcl-make_first' failed
make: *** [sub-ScriptingTcl-make_first] Error 2
==> ERROR: A failure occurred in build().
Aborting...
==> ERROR: Makepkg was unable to build sqlitestudio.
==> Restart building sqlitestudio ? [y/N]
==> -------------------------------------
==>

I tried both setting some default includes variable to an empty string as a qmake parameter as well as trying on a non-zsh shell to ensure my path variable was the default value (not the mangled one as a result of all my shell add-ons).

The full install log is here:
https://pastee.org/d6x6e

My workaround is downloading the pre-built version from sqlitestudio.com, but I would like to rely on aur more for my third-party applications and am interested in why the build fails.

Much appreciated,
Phil