Package Base Details: qt-installer-framework

Git Clone URL: https://aur.archlinux.org/qt-installer-framework.git (read-only)
Submitter: Schala
Maintainer: Muflone (Skycoder42)
Last Packager: Skycoder42
Votes: 82
Popularity: 0.37
First Submitted: 2014-07-10 20:06
Last Updated: 2019-04-18 08:01

Latest Comments

« First ‹ Previous 1 2 3 Next › Last »

doviethoa commented on 2017-08-31 10:45

Suggest PKGBUILD for version 2.0.5-1:

# Maintainer: Danny Dutton <duttondj@vt.edu>

pkgname="qt-installer-framework"
pkgver=2.0.5
pkgrel=1
_pkgver=2.0.5-1
_qtver=5.4.2
pkgdesc="The Qt Installer Framework used for the Qt SDK installer."
arch=('i686' 'x86_64')
url='http://qt-project.org/wiki/Qt-Installer-Framework'
license=('FDL' 'LGPL')
makedepends=("qt5-base>=${_qtver}" "qt5-tools>=${_qtver}" "qt5-declarative>=${_qtver}")
groups=('qt' 'qt5')
_pkgfqn="${pkgname}-opensource-${_pkgver}-src"
source=("https://download.qt.io/official_releases/${pkgname}/${_pkgver}/${_pkgfqn}.tar.gz")
md5sums=('12d646e9016115895365c7db4d653d0e')

build() {
cd "${srcdir}"
qmake-qt5 ./installerfw.pro
make -j4
make docs -j4
cd "${srcdir}/tests"
qmake-qt5 ./tests.pro
make -j4
}

package() {
install -d ${pkgdir}/usr/{bin,lib,share/{${pkgname},doc/{qt,${pkgname}},licenses/${pkgname}}}
cd "${srcdir}"
install -m644 LICENSE.FDL "${pkgdir}/usr/share/licenses/${pkgname}/"
install -m644 LICENSE.GPL3-EXCEPT "${pkgdir}/usr/share/licenses/${pkgname}/"
cp -a ./bin/* "${pkgdir}/usr/bin/"
cp -a ./lib/* "${pkgdir}/usr/lib/"
cp -a "./doc/html" "${pkgdir}/usr/share/doc/${pkgname}/"
cp "./doc/ifw.qch" "${pkgdir}/usr/share/doc/qt/"
cp -a "./tests" "${pkgdir}/usr/share/${pkgname}/"
cp -a "./examples" "${pkgdir}/usr/share/${pkgname}/"
}

rtfreedman commented on 2017-07-23 20:39

Please update to 2.0.5.1

Anonymous comment on 2016-12-31 12:24

**EDIT:** Never mind I'm installing qt-installer-framework now with makepkg.
I just don't understand why the foxitreader package didn't do that for me.
Thanks for this package.

What's up with qt-installer-framework?

[robert@designbox ~]# cd /tmp/foxitreader
[robert@designbox foxitreader]# makepkg -si
==> Making package: foxitreader 2.2.1025-1 (Sat 31 Dec 2016 12:58:50 CET)
==> Checking runtime dependencies...
==> Checking buildtime dependencies...
==> Installing missing dependencies...
[sudo] password for robert:
error: target not found: qt-installer-framework
==> ERROR: 'pacman' failed to install missing dependencies.

duttondj commented on 2016-05-24 22:24

Not totally sure what the issue is for you. I receive the same errors but the make doesn't fail for me. It's an upstream issue that can be replicated by running "make docs".

JohnRobson commented on 2016-05-20 00:05

In file included from /tmp/yaourt-tmp-us/aur-qt-installer-framework/src/qt-installer-framework-opensource-2.0.3-src/doc/installerfw.qdocconf:2:
/tmp/yaourt-tmp-us/aur-qt-installer-framework/src/qt-installer-framework-opensource-2.0.3-src/doc/config/ifw.qdocconf:1: error: Cannot open file '/usr/share/doc/qt/global/macros.qdocconf': No such file or directory
Cannot open file '/usr/share/doc/qt/global/macros.qdocconf': No such file or directory

Aborting
Makefile:636: recipe for target 'html_docs' failed
make: *** [html_docs] Error 1
==> ERROR: A failure occurred in build().
Aborting...
==> ERROR: Makepkg was unable to build qt-installer-framework.
==> Restart building qt-installer-framework ? [y/N]
==> -----------------------------------------------
==>
==> ERROR: unable to update

outofdate2 commented on 2016-05-14 17:33

Sources:
http -> https
pls

duttondj commented on 2016-03-29 15:01

Updated dependencies

rekill commented on 2016-03-29 08:39

ERROR: A failure occurred in build().
Project ERROR: Unknown module(s) in QT: qml

qml located in package qt5-declarative

Please add qt5-declarative dependency

duttondj commented on 2015-11-16 23:29

Adopted the package so I could add the qt5-tools dependency.

t0m5k1 commented on 2015-11-10 18:36

==> Making package: qt-installer-framework 2.0.1-1 (Tue 10 Nov 18:33:23 GMT 2015)
==> Checking runtime dependencies...
==> Checking buildtime dependencies...
==> Retrieving sources...
-> Found qt-installer-framework-opensource-2.0.1-src.tar.gz
==> Validating source files with md5sums...
qt-installer-framework-opensource-2.0.1-src.tar.gz ... Passed
==> Extracting sources...
-> Extracting qt-installer-framework-opensource-2.0.1-src.tar.gz with bsdtar
==> Removing existing $pkgdir/ directory...
==> Starting build()...
fatal: Not a git repository (or any of the parent directories): .git
cd src/ && ( test -e Makefile || /usr/bin/qmake-qt5 /var/cache/pacman/builds/qt-installer-framework/src/qt-installer-framework-opensource-2.0.1-src/src/src.pro -o Makefile ) && make -f Makefile
make[1]: Entering directory '/var/cache/pacman/builds/qt-installer-framework/src/qt-installer-framework-opensource-2.0.1-src/src'
cd libs/ && ( test -e Makefile || /usr/bin/qmake-qt5 /var/cache/pacman/builds/qt-installer-framework/src/qt-installer-framework-opensource-2.0.1-src/src/libs/libs.pro -o Makefile ) && make -f Makefile
make[2]: Entering directory '/var/cache/pacman/builds/qt-installer-framework/src/qt-installer-framework-opensource-2.0.1-src/src/libs'
cd 7zip/ && ( test -e Makefile || /usr/bin/qmake-qt5 /var/cache/pacman/builds/qt-installer-framework/src/qt-installer-framework-opensource-2.0.1-src/src/libs/7zip/7zip.pro -o Makefile ) && make -f Makefile
fatal: Not a git repository (or any of the parent directories): .git
Project ERROR: Unknown module(s) in QT: uitools
Makefile:43: recipe for target 'sub-7zip-make_first-ordered' failed
make[2]: *** [sub-7zip-make_first-ordered] Error 3
make[2]: Leaving directory '/var/cache/pacman/builds/qt-installer-framework/src/qt-installer-framework-opensource-2.0.1-src/src/libs'
Makefile:43: recipe for target 'sub-libs-make_first-ordered' failed
make[1]: *** [sub-libs-make_first-ordered] Error 2
make[1]: Leaving directory '/var/cache/pacman/builds/qt-installer-framework/src/qt-installer-framework-opensource-2.0.1-src/src'
Makefile:43: recipe for target 'sub-src-make_first-ordered' failed
make: *** [sub-src-make_first-ordered] Error 2



any clues as to how I fix this?