Package Base Details: pamac-aur-git

Git Clone URL: (read-only, click to copy)
Keywords: gui installer pacman
Submitter: FredBezies
Maintainer: FredBezies
Last Packager: FredBezies
Votes: 18
Popularity: 1.70
First Submitted: 2017-09-09 10:09
Last Updated: 2020-05-30 12:28

Latest Comments

« First ‹ Previous 1 2 3 4 Next › Last »

ax34 commented on 2019-06-25 18:32

@FredBezies, then conflicts=('pamac') should be enough.

replaces=('something') will replace "something" package with current package even if i don't install current package.

I installed "pamac-aur" and now yay wants to replace it with "pamac-aur-git" though i don't want to install "pamac-aur-git".

flash872 commented on 2019-06-25 11:34

Even after the release of pamac-aur-git 7.4.0.r24.g3bcb34d-1, I'm still having the issue that this package seems to be building, but then not installing. I don't see any open reports upstream. Is anyone else having this issue?

FredBezies commented on 2019-06-24 18:51

@ax34: in order to avoid conflicting binaries? :D

ax34 commented on 2019-06-24 18:10

I still don't understand. Why "something-git" package should replace "something" package while "something" package is still actual and popular?

FredBezies commented on 2019-06-24 07:11

@ax34: a security I added for manjaro users. Antergos added its version of pamac in its own repository.

So this is why there is a replace() function added in PKGBUILD.

ax34 commented on 2019-06-24 00:08

Yay tries to replace pamac-aur with this package because of replaces=('pamac') Why does this package replace pamac?

FredBezies commented on 2019-06-22 20:46

See : and

For example.

flash872 commented on 2019-06-22 20:29

This package seems to be building, but then not installing. Is anyone else having the same issue?

Edit-1 | Thanks @FredBezies. Mea culpa; I omitted checking upstream for the issue. I assumed it was something local on my machine.

FredBezies commented on 2019-01-23 13:01

@mozzi32: bug rapporté. Ça semble exploser en vol avec vala 0.42.5.

mozzi32 commented on 2019-01-23 12:02

J'ai un msg d'erreur avec la version 7.3.4-1 "../src/transaction.vala:1313.16-1313.39: error: The type name AURPackageStruct' could not be found foreach (unowned AURPackageStruct infos in summary_struct.to_build) { ^^^^^^^^^^^^^^^^^^^^^^^^ ../src/transaction_interface.vala:36.19-36.42: error: The type nameTransactionSummaryStruct' could not be found public abstract TransactionSummaryStruct get_transaction_summary (); ^^^^^^^^^^^^^^^^^^^^^^^^ ../src/transaction_interface_daemon.vala:38.19-38.42: error: The type name TransactionSummaryStruct' could not be found public abstract TransactionSummaryStruct get_transaction_summary () throws Error; ^^^^^^^^^^^^^^^^^^^^^^^^ Command-line option--thread` is deprecated and will be ignored Compilation failed: 43 error(s), 0 warning(s) ninja: build stopped: subcommand failed. ==> ERREUR : Une erreur s’est produite dans build(). Abandon… ==> Removing installed dependencies..."

As-tu une idée sur le pb ?