Package Base Details: mysql

Git Clone URL: (read-only, click to copy)
Submitter: Barthalion
Maintainer: Muflone
Last Packager: Muflone
Votes: 67
Popularity: 0.49
First Submitted: 2013-04-25 19:13
Last Updated: 2019-11-16 20:01

Latest Comments

« First ‹ Previous 1 2 3 4 5 6 7 ... Next › Last »

Muflone commented on 2019-08-04 22:25

@salifm did you bothered to read the error message? you have no space left in your file system

salifm commented on 2019-08-04 19:39

[ 89%] Linking CXX executable ../runtime_output_directory/mysqld /home/salif/.cache/yay/mysql/src/mysql-8.0.17/sql/parser_yystype.h:239:7: warning: type ‘union YYSTYPE’ violates the C++ One Definition Rule [-Wodr] 239 | union YYSTYPE { | ^ /home/salif/.cache/yay/mysql/src/mysql-8.0.17/storage/innobase/include/fts0pars.h:50: note: a different type is defined in another translation unit 50 | typedef union YYSTYPE | /home/salif/.cache/yay/mysql/src/mysql-8.0.17/sql/parser_yystype.h:240:17: note: the first difference of corresponding definitions is field ‘lexer’ 240 | Lexer_yystype lexer; // terminal values from the lexical scanner | ^ fts0pars.y:62: note: a field with different name is defined in another translation unit lto-wrapper: fatal error: write: No space left on device

compilation terminated. /usr/bin/ fatal error: lto-wrapper failed collect2: error: ld returned 1 exit status make[2]: [sql/CMakeFiles/mysqld.dir/build.make:147: runtime_output_directory/mysqld] Error 1 make[1]: [CMakeFiles/Makefile2:7078: sql/CMakeFiles/mysqld.dir/all] Error 2 make: *** [Makefile:152: all] Error 2 ==> ERROR: A failure occurred in build(). Aborting...

francoism90 commented on 2019-08-02 08:49

@tlo MySQL should now automatically upgrade:

tlo commented on 2019-06-28 14:05

NVM: Upon further investigation I found this is a deprecated command my apologies for the useless comment.

I have just built mysql-8.0.16-1 and after installing I noticed mysql_upgrade was built (src/build/runtime_output_directory/mysql_upgrade) but was not installed to the system it appears to be missing from the pkg not sure if this is a bug or a strange fluke on my machine. In case it matters downloaded with yay -G aur/mysql and built with makepkg -si

Muflone commented on 2019-06-23 22:39


thank you for your precious work. I've integrated some of your fixes and changes. (now mysql builds fine with ccache)

francoism90 commented on 2019-06-14 12:12

@svenaugustus you need to recompile this package (MySQL) - don't know what lib(s) causing this issue. I recommend to reboot first before doing prior compiling.

svenaugustus commented on 2019-06-13 13:31

$ mysqld --initialize --user=mysql

mysqld: error while loading shared libraries: cannot open shared object file: No such file or directory

something wrong while libicuuc haved updated to version 64. =。=

francoism90 commented on 2019-05-31 12:04

@Muflone @others I have created MySQL 8.16, did a clean-up, switched to systemd provided by pkg, used some stuff seen in MariaDB pkg and updated the my-default.cnf:

It would be great if you take a look and tell me what you think. :) I did not use and, are they still needed?

francoism90 commented on 2019-05-22 18:45

@Muflone Seems MySQL provide systemd service OOTB:

Is there any reason why not using (a patched) upstream one? :)

Would LTO help to optimize MySQL?

Ildar commented on 2019-05-16 04:32

Could you change the build instructions to compile MySQL with bundled libedit as they do not support any other version of libedit?

It is the problem with not-working CTRL+W hotkey

I tried to downgrade to libedit-20180525_3.1-1 before the compilation, but it didn't help.

@Khaithang try yay mysql-clients