Package Base Details: libindicate

Git Clone URL: https://aur.archlinux.org/libindicate.git (read-only)
Submitter: max.bra
Maintainer: gerito
Last Packager: gerito
Votes: 71
Popularity: 0.000000
First Submitted: 2009-11-16 20:50
Last Updated: 2015-11-14 03:45

Latest Comments

« First ‹ Previous 1 2 3 4 5 6

alphazo commented on 2010-04-09 20:23

Would not compile:

make all-recursive
make[1]: entrant dans le répertoire « /tmp/yaourt-tmp-alphazo/aur-libindicate/libindicate/src/libindicate-0.3.2 »
Making all in libindicate
make[2]: entrant dans le répertoire « /tmp/yaourt-tmp-alphazo/aur-libindicate/libindicate/src/libindicate-0.3.2/libindicate »
(echo "#include \"indicate-marshal.h\"" ; \
/usr/bin/glib-genmarshal \
--prefix=_indicate_marshal \
--body \
./indicate-marshal.list) > xgen-mc \
&& cp xgen-mc indicate-marshal.c \
&& rm -f xgen-mc
make all-am
make[3]: entrant dans le répertoire « /tmp/yaourt-tmp-alphazo/aur-libindicate/libindicate/src/libindicate-0.3.2/libindicate »
CC libindicate_la-indicate-marshal.lo
CCLD libindicate.la
make[3]: quittant le répertoire « /tmp/yaourt-tmp-alphazo/aur-libindicate/libindicate/src/libindicate-0.3.2/libindicate »
make[2]: quittant le répertoire « /tmp/yaourt-tmp-alphazo/aur-libindicate/libindicate/src/libindicate-0.3.2/libindicate »
Making all in libindicate-gtk
make[2]: entrant dans le répertoire « /tmp/yaourt-tmp-alphazo/aur-libindicate/libindicate/src/libindicate-0.3.2/libindicate-gtk »
CCLD libindicate-gtk.la
/usr/bin/g-ir-scanner \
-v --namespace Indicate \
--nsversion=0.2 \
--add-include-path=. \
--include=GObject-2.0 \
--include=GLib-2.0 \
--include=GdkPixbuf-2.0 \
--include=Indicate-0.2 \
--add-include-path=../libindicate \
--library=indicate --pkg indicate \
--output Indicate-Gtk-0.2.gir ./indicator.h ./listener.h
Package indicate was not found in the pkg-config search path.
Perhaps you should add the directory containing `indicate.pc'
to the PKG_CONFIG_PATH environment variable
No package 'indicate' found
Package indicate was not found in the pkg-config search path.
Perhaps you should add the directory containing `indicate.pc'
to the PKG_CONFIG_PATH environment variable
No package 'indicate' found
Dans le fichier inclus à partir de <stdin>:4:
/tmp/yaourt-tmp-alphazo/aur-libindicate/libindicate/src/libindicate-0.3.2/libindicate-gtk/indicator.h:33:18: erreur: glib.h : Aucun fichier ou dossier de ce type
/tmp/yaourt-tmp-alphazo/aur-libindicate/libindicate/src/libindicate-0.3.2/libindicate-gtk/indicator.h:34:35: erreur: gdk-pixbuf/gdk-pixbuf.h : Aucun fichier ou dossier de ce type
/tmp/yaourt-tmp-alphazo/aur-libindicate/libindicate/src/libindicate-0.3.2/libindicate-gtk/indicator.h:35:35: erreur: libindicate/indicator.h : Aucun fichier ou dossier de ce type
Dans le fichier inclus à partir de <stdin>:5:
/tmp/yaourt-tmp-alphazo/aur-libindicate/libindicate/src/libindicate-0.3.2/libindicate-gtk/listener.h:36:34: erreur: libindicate/listener.h : Aucun fichier ou dossier de ce type
/tmp/yaourt-tmp-alphazo/aur-libindicate/libindicate/src/libindicate-0.3.2/libindicate-gtk/indicator.h:37: syntax error, unexpected identifier in '# 37 "/tmp/yaourt-tmp-alphazo/aur-libindicate/libindicate/src/libindicate-0.3.2/libindicate-gtk/indicator.h"' at 'G_BEGIN_DECLS'
/tmp/yaourt-tmp-alphazo/aur-libindicate/libindicate/src/libindicate-0.3.2/libindicate-gtk/indicator.h:40: syntax error, unexpected '*', expecting ')' or ',' in 'void indicate_indicator_set_property_icon (IndicateIndicator * indicator, const gchar * key, const GdkPixbuf * data);' at '*'
/tmp/yaourt-tmp-alphazo/aur-libindicate/libindicate/src/libindicate-0.3.2/libindicate-gtk/listener.h:40: syntax error, unexpected '*', expecting ')' or ',' in 'typedef void (*indicate_listener_get_property_icon_cb) (IndicateListener * listener,' at '*'
/tmp/yaourt-tmp-alphazo/aur-libindicate/libindicate/src/libindicate-0.3.2/libindicate-gtk/listener.h:47: syntax error, unexpected '*', expecting ')' or ',' in 'void indicate_listener_get_property_icon (IndicateListener * listener,' at '*'
/usr/bin/ld: cannot find -lindicate
collect2: ld returned 1 exit status
Traceback (most recent call last):
File "/usr/bin/g-ir-scanner", line 38, in <module>
sys.exit(scanner_main(sys.argv))
File "/usr/lib/gobject-introspection/giscanner/scannermain.py", line 317, in scanner_main
glibtransformer.get_get_type_functions())
File "/usr/lib/gobject-introspection/giscanner/dumper.py", line 231, in compile_introspection_binary
return dc.run()
File "/usr/lib/gobject-introspection/giscanner/dumper.py", line 132, in run
self._link(bin_path, o_path)
File "/usr/lib/gobject-introspection/giscanner/dumper.py", line 226, in _link
subprocess.check_call(args)
File "/usr/lib/python2.6/subprocess.py", line 498, in check_call
raise CalledProcessError(retcode, cmd)
subprocess.CalledProcessError: Command '['libtool', '--mode=link', '--tag=CC', '--silent', 'gcc', '-o', '/tmp/yaourt-tmp-alphazo/aur-libindicate/libindicate/src/libindicate-0.3.2/libindicate-gtk/tmp-introspectCRHxej/Indicate-0.2', '-march=i686', '-mtune=generic', '-O2', '-pipe', '-L.', '-lindicate', '-pthread', '-Wl,--export-dynamic', '-lgio-2.0', '-lgirepository-1.0', '-lgobject-2.0', '-lgmodule-2.0', '-lffi', '-lgthread-2.0', '-lrt', '-lglib-2.0', '/tmp/yaourt-tmp-alphazo/aur-libindicate/libindicate/src/libindicate-0.3.2/libindicate-gtk/tmp-introspectCRHxej/Indicate-0.2.o']' returned non-zero exit status 1
make[2]: *** [Indicate-Gtk-0.2.gir] Erreur 1
make[2]: quittant le répertoire « /tmp/yaourt-tmp-alphazo/aur-libindicate/libindicate/src/libindicate-0.3.2/libindicate-gtk »
make[1]: *** [all-recursive] Erreur 1
make[1]: quittant le répertoire « /tmp/yaourt-tmp-alphazo/aur-libindicate/libindicate/src/libindicate-0.3.2 »
make: *** [all] Erreur 2
==> ERREUR: La compilation a échoué.
Abandon...
Error: Makepkg n'a pas pu construire le paquetage libindicate.


==> Installation ou compilation des dépendances de empathy-indicate: