Package Base Details: lib32-gstreamer0.10-bad

Git Clone URL: https://aur.archlinux.org/lib32-gstreamer0.10-bad.git (read-only)
Keywords: lib32
Submitter: None
Maintainer: None
Last Packager: GordonGR
Votes: 10
Popularity: 0.000000
First Submitted: 2010-02-26 00:03
Last Updated: 2016-12-10 14:15

Latest Comments

« First ‹ Previous 1 2

Roken commented on 2013-05-13 16:42

I've been getting build failures on this for ages, and no idea what else I can do to fix it:

/usr/bin/ld: skipping incompatible /usr/lib/gcc/x86_64-unknown-linux-gnu/4.8.0/../../../librdf.so when searching for -lrdf
/usr/bin/ld: skipping incompatible /usr/lib/librdf.so when searching for -lrdf
/usr/bin/ld: cannot find -lrdf
/usr/bin/ld: skipping incompatible /usr/lib/gcc/x86_64-unknown-linux-gnu/4.8.0/../../../libslv2.so when searching for -lslv2
/usr/bin/ld: skipping incompatible /usr/lib/libslv2.so when searching for -lslv2
/usr/bin/ld: cannot find -lslv2
collect2: error: ld returned 1 exit status
make[3]: *** [libgstlv2.la] Error 1

Any ideas?

Anonymous comment on 2013-04-16 13:00

the lib32-opus package does not exist on AUR, so the compilation fails.

Adding --disable-opus to the configure command line fixes the problem.

Anonymous comment on 2012-09-18 07:12

Compilation now fails with


/usr/include/gstreamer-0.10/gst/gstinfo.h:274:48: erreur: expected ‘)’ before ‘__attribute__’
/usr/include/gstreamer-0.10/gst/gstinfo.h:274:48: erreur: expected ‘,’ or ‘;’ before ‘)’ token
/usr/include/gstreamer-0.10/gst/gstinfo.h:296:68: erreur: expected ‘)’ before ‘__attribute__’
/usr/include/gstreamer-0.10/gst/gstinfo.h:296:68: erreur: expected ‘,’ or ‘;’ before ‘)’ token
/usr/include/gstreamer-0.10/gst/gstinfo.h:321:51: erreur: expected ‘)’ before ‘__attribute__’
/usr/include/gstreamer-0.10/gst/gstinfo.h:321:51: erreur: expected ‘,’ or ‘;’ before ‘)’ token
/usr/include/gstreamer-0.10/gst/gstinfo.h:333:70: erreur: expected ‘)’ before ‘__attribute__’
/usr/include/gstreamer-0.10/gst/gstinfo.h:333:70: erreur: expected ‘,’ or ‘;’ before ‘)’ token
make[3]: *** [dfb_example-dfb-example.o] Erreur 1

nivardus commented on 2012-05-20 14:30

lib32-celt seems to be a dependency missing from the dep list.

rafaelff commented on 2012-04-24 03:35

@Peace4all: fixed in 0.10.23-2

Peace4all commented on 2012-04-23 10:47

I encountered a problem compiling this package after installing 'opencv', which is in a chain of dependencies installed with the 'openshot' package. The error includes several lines similar to:

/usr/bin/ld: skipping incompatible /usr/lib/gcc/x86_64-unknown-linux-gnu/4.7.0/../../../libopencv_core.so when searching for -lopencv_core

After adding the flag '--disable-opencv' to the PKGBUILD, I was able to successfully compile with opencv installed, as in this example PKGBUILD, http://pastebin.com/jN2WRHW6.

rafaelff commented on 2012-01-26 02:23

Adopted and fixed. Heads up for the number of packages in makedepends in the PKGBUILD. I suggest using "yaourt -S --noconfirm lib32-gstreamer0.10-bad" to avoid the need of confirming installation of all dependencies.

Anonymous comment on 2011-09-07 04:59

pkgver=0.10.22
pkgrel=1
md5sums=('2669120128fcf478d5cc9b25e0f794ac')

Anonymous comment on 2011-03-08 04:54

--- PKGBUILD.org 2011-02-21 06:28:32.000000000 -0300
+++ PKGBUILD 2011-03-08 01:54:05.990000004 -0300
@@ -3,4 +3,4 @@
pkgname=lib32-gstreamer0.10-bad
-pkgver=0.10.20
-pkgrel=1
+pkgver=0.10.21
+pkgrel=2
pkgdesc="GStreamer Multimedia Framework Bad Plugins (gst-plugins-bad)"
@@ -12,3 +12,3 @@
source=(ftp://ftp.archlinux.org/extra/os/i686/${pkgname/lib32-/}-${pkgver}-${pkgrel}-i686.pkg.tar.xz)
-md5sums=('25aeed78ee3428962a53f5a648794f80')
+md5sums=('f676d3f1ed454de75e8956a5bb6e153d')