Package Base Details: gstreamer0.10-good

Git Clone URL: https://aur.archlinux.org/gstreamer0.10-good.git (read-only)
Submitter: yurikoles
Maintainer: kirillnow
Last Packager: kirillnow
Votes: 40
Popularity: 0.016241
First Submitted: 2017-01-26 13:56
Last Updated: 2017-11-18 09:39

Latest Comments

« First ‹ Previous 1 2 3 4 5 Next › Last »

javum commented on 2017-04-21 03:14

error: failed to prepare transaction (could not satisfy dependencies)
:: gstreamer0.10-good-plugins: installing libsoup (2.57.1+29+g5b6d632a-2) breaks dependency 'libsoup-gnome'

ata commented on 2017-03-17 17:21

git clone https://aur.archlinux.org/gstreamer0.10-good.git
cd gstreamer0.10-good
makepkg -g >> PKGBUILD
makepkg -sri

enjoy

ector commented on 2017-01-31 09:21

thanks to the maintainer, I installed without problems

cybertron commented on 2017-01-30 18:53

Error: 'gstreamer0.10-good-plugins-0.10.31-16-x86_64.pkg.tar.xz': Twice Target

same with other gstreamer0.10 stuff, building with packer

dixi_minga commented on 2017-01-28 17:07

I have the same problem as daedite66 has

test-suite.log:
FAIL: generic/states
====================

Running suite(s): states
66%: Checks: 3, Failures: 0, Errors: 1
generic/states.c:113:E:general:test_state_changes_up_and_down_seq:0: (after this point) Test timeout expired
FAIL generic/states (exit status: 1)

frederick_monk commented on 2017-01-28 16:27

@yurikoles: Now it worked for me. gstreamer0.10-* is now up to date on my machines. Thank you!

deadite66 commented on 2017-01-28 16:16

FAIL: elements/souphttpsrc
============================================================================
Testsuite summary for GStreamer Good Plug-ins 0.10.31
============================================================================
# TOTAL: 69
# PASS: 68
# SKIP: 0
# XFAIL: 0
# FAIL: 1
# XPASS: 0
# ERROR: 0
============================================================================
See tests/check/test-suite.log
Please report to http://bugzilla.gnome.org/enter_bug.cgi?product=GStreamer
============================================================================
make[4]: *** [Makefile:2948: test-suite.log] Error 1
make[4]: Leaving directory '/tmp/yaourt-tmp-lee/aur-gstreamer0.10-good/src/gst-plugins-good/tests/check'
make[3]: *** [Makefile:3056: check-TESTS] Error 2
make[3]: Leaving directory '/tmp/yaourt-tmp-lee/aur-gstreamer0.10-good/src/gst-plugins-good/tests/check'
make[2]: *** [Makefile:3610: check-am] Error 2
make[2]: Leaving directory '/tmp/yaourt-tmp-lee/aur-gstreamer0.10-good/src/gst-plugins-good/tests/check'
make[1]: *** [Makefile:593: check-recursive] Error 1
make[1]: Leaving directory '/tmp/yaourt-tmp-lee/aur-gstreamer0.10-good/src/gst-plugins-good/tests'
make: *** [Makefile:715: check-recursive] Error 1

yurikoles commented on 2017-01-28 14:28

@all please update

ector commented on 2017-01-28 14:17

Me too

Swipe commented on 2017-01-28 13:46

Me too