Package Base Details: gstreamer0.10-base

Git Clone URL: https://aur.archlinux.org/gstreamer0.10-base.git (read-only, click to copy)
Submitter: yurikoles
Maintainer: ava1ar
Last Packager: ava1ar
Votes: 123
Popularity: 1.37
First Submitted: 2017-01-26 13:45
Last Updated: 2020-04-19 04:37

Latest Comments

« First ‹ Previous ... 6 7 8 9 10 11

flying-sheep commented on 2017-01-27 11:30

doesn’t compile!

In file included from /usr/include/gstreamer-0.10/gst/gst.h:32:0,
from gstadder.h:26,
from gstadder.c:46:
/usr/include/gstreamer-0.10/gst/gstversion.h:48:27: Fehler: expected declaration specifiers or »...« before »(« token
#define GST_VERSION_MAJOR (0)
^
gstadder.c:1329:21: Anmerkung: bei Substitution des Makros »GST_VERSION_MAJOR«
GST_PLUGIN_DEFINE2 (GST_VERSION_MAJOR,
^~~~~~~~~~~~~~~~~
/usr/include/gstreamer-0.10/gst/gstversion.h:54:27: Fehler: expected declaration specifiers or »...« before »(« token
#define GST_VERSION_MINOR (10)
^
gstadder.c:1330:5: Anmerkung: bei Substitution des Makros »GST_VERSION_MINOR«
GST_VERSION_MINOR,
^~~~~~~~~~~~~~~~~
gstadder.c:1331:5: Fehler: unbekannter Typname: »adder«
adder,
^~~~~
gstadder.c:1332:5: Fehler: expected declaration specifiers or »...« before string constant
"Adds multiple streams",
^~~~~~~~~~~~~~~~~~~~~~~
gstadder.c:1333:5: Fehler: expected declaration specifiers or »...« before »plugin_init«
plugin_init, VERSION, "LGPL", GST_PACKAGE_NAME, GST_PACKAGE_ORIGIN)
^~~~~~~~~~~
In file included from gstadder.c:44:0:
../../config.h:394:17: Fehler: expected declaration specifiers or »...« before string constant
#define VERSION "0.10.36"
^
gstadder.c:1333:18: Anmerkung: bei Substitution des Makros »VERSION«
plugin_init, VERSION, "LGPL", GST_PACKAGE_NAME, GST_PACKAGE_ORIGIN)
^~~~~~~
gstadder.c:1333:27: Fehler: expected declaration specifiers or »...« before string constant
plugin_init, VERSION, "LGPL", GST_PACKAGE_NAME, GST_PACKAGE_ORIGIN)
^~~~~~
In file included from gstadder.c:44:0:
../../config.h:82:26: Fehler: expected declaration specifiers or »...« before string constant
#define GST_PACKAGE_NAME "GStreamer Base Plugins (Archlinux)"
^
../../config.h:82:26: Anmerkung: in Definition des Makros »GST_PACKAGE_NAME«
#define GST_PACKAGE_NAME "GStreamer Base Plugins (Archlinux)"
^~~~~~~~~~~~~~~~~~~~~~~~~~~~~~~~~~~~
../../config.h:85:28: Fehler: expected declaration specifiers or »...« before string constant
#define GST_PACKAGE_ORIGIN "http://www.archlinux.org/"
^
gstadder.c:1333:53: Anmerkung: bei Substitution des Makros »GST_PACKAGE_ORIGIN«
plugin_init, VERSION, "LGPL", GST_PACKAGE_NAME, GST_PACKAGE_ORIGIN)
^~~~~~~~~~~~~~~~~~
gstadder.c:1315:1: Warnung: »plugin_init« defined but not used [-Wunused-function]
plugin_init (GstPlugin * plugin)
^~~~~~~~~~~
make[4]: *** [Makefile:687: libgstadder_la-gstadder.lo] Fehler 1
make[4]: Verzeichnis „/home/phil/.cache/pacaur/gstreamer0.10-base/src/gst-plugins-base/gst/adder“ wird verlassen
make[3]: *** [Makefile:583: all] Fehler 2
make[3]: Verzeichnis „/home/phil/.cache/pacaur/gstreamer0.10-base/src/gst-plugins-base/gst/adder“ wird verlassen
make[2]: *** [Makefile:833: adder] Fehler 2
make[2]: Verzeichnis „/home/phil/.cache/pacaur/gstreamer0.10-base/src/gst-plugins-base/gst“ wird verlassen
make[1]: *** [Makefile:678: all-recursive] Fehler 1
make[1]: Verzeichnis „/home/phil/.cache/pacaur/gstreamer0.10-base/src/gst-plugins-base“ wird verlassen
make: *** [Makefile:607: all] Fehler 2