Package Base Details: freetype2-infinality

Git Clone URL: (read-only, click to copy)
Submitter: None
Maintainer: kugland
Last Packager: SolarAquarion
Votes: 465
Popularity: 0.110784
First Submitted: 2010-07-14 15:27
Last Updated: 2020-04-20 21:12

Latest Comments

« First ‹ Previous 1 2 3 4 5 6 7 8 9 ... Next › Last »

hpstg commented on 2017-02-16 13:48

Any way for this to be fixed/patched/maintained? The fonts really look better with it.

jaro3 commented on 2017-01-17 12:15

harfbuzz doesn't build :-( The only solution is to get rid of these unmaintained infinality fonts as described here:

HarfBuzz 1.4.1: test/shaping/test-suite.log

# TOTAL: 24
# PASS: 22
# SKIP: 0
# XFAIL: 0
# FAIL: 2
# XPASS: 0
# ERROR: 0

.. contents:: :depth: 2

FAIL: tests/arabic-fallback-shaping

Running tests in ./tests/arabic-fallback-shaping.tests
Testing fonts/sha1sum/df768b9c257e0c9c35786c47cae15c46571d56be.ttf:U+0633,U+064F,U+0644,U+064E,U+0651,U+0627,U+0651,U+0650,U+0645,U+062A,U+06CC
Actual: [uni06CC.fina=10+1655|uni062A.medi=9+868|uni0645.init=8+1098|uni0650=2@189,0+0|uni0651=2@228,736+0|uni064E=2@967,1259+0|uni0651=2@1006,736+0|uni06440627.fina=2+1470|uni064F=0@558,-10+0|uni0633.init=0+1585]
Expected: [uni06CC.fina=10+1655|uni062A.medi=9+868|uni0645.init=8+1098|uni0650=2@221,0+0|uni0651=2@260,736+0|uni064E=2@935,1259+0|uni0651=2@974,736+0|uni06440627.fina=2+1470|uni064F=0@558,-10+0|uni0633.init=0+1585]
1 tests failed.
FAIL tests/arabic-fallback-shaping.tests (exit status: 1)

FAIL: tests/vertical

Running tests in ./tests/vertical.tests
Testing fonts/sha1sum/191826b9643e3f124d865d617ae609db6a2ce203.ttf:U+300C
Actual: [uni300C.vert=0@-448,-578+0,-1024]
Expected: [uni300C.vert=0@-512,-578+0,-1024]
Testing fonts/sha1sum/f9b1dd4dcb515e757789a22cb4241107746fd3d0.ttf:U+0041,U+0042
Actual: [gid1=0@-590,-2128+0,-2789|gid2=1@-601,-2125+0,-2789]
Expected: [gid1=0@-654,-2128+0,-2789|gid2=1@-665,-2125+0,-2789]
Testing fonts/sha1sum/f9b1dd4dcb515e757789a22cb4241107746fd3d0.ttf:U+0041,U+0042
2 tests failed.
FAIL tests/vertical.tests (exit status: 1)

==> ERROR: A failure occurred in check().

Ralf_Mardorf commented on 2017-01-15 16:09

To workaround the harfbuzz issue, you need to recompile harfbuzz.

$ sudo abs
$ sudo pacman -Syu
$ cp -ai /var/abs/extra/harfbuzz/ /tmp/
$ cd /tmp/harfbuzz/
$ makepkg -si

With nano you could edit the pkgrel, but it's not required, you could rebuild harfbuzz without editing anything, just rebuild it.

This is already explained by my comment from 2017-01-12.

Please use a forum to get help, the comments are inappropriate.

fausterjames commented on 2017-01-15 15:12

I'm here because I can't run some programs like deluge. Running deluge gets me :

> ImportError: /usr/lib/ undefined symbol: FT_Get_Var_Blend_Coordinates

When I post this on harfbuzz github they tell me that the bug isn't related to them but to this package freetype2-infinality as their package is build against the latest freetype2 package,

See this issue :

I also don't understand why you're able to install freetype2 and remove freetype2-infinality when I have this error message. I was able to replace fontconfig-infinality with fontconfig but it didn't help much with the main problem.

Ralf_Mardorf commented on 2017-01-15 14:23

freetype from official repositories and freetype2-infinality are in sync. What version do you expect?
The error message you get informs you about what you need to do. Doesn't it?
However, installing freetype2 could be done on my install, without such an issue.
The comments aren't the right place to request the kind of help you need.

[rocketmouse@archlinux ~]$ pacman -Si freetype2 | grep Ver
Version : 2.7.1-1
[rocketmouse@archlinux ~]$ grep freetype2-infinality /var/log/pacman.log | tail -1
[2017-01-14 12:22] [ALPM] upgraded freetype2-infinality (2.7-1 -> 2.7.1-1)
[rocketmouse@archlinux ~]$ sudo pacman -S freetype2
resolving dependencies...
looking for conflicting packages...
:: freetype2 and freetype2-infinality are in conflict. Remove freetype2-infinality? [y/N] y

Packages (2) freetype2-infinality-2.7.1-1 [removal] freetype2-2.7.1-1

Total Download Size: 2.56 MiB
Total Installed Size: 5.74 MiB
Net Upgrade Size: -0.60 MiB

:: Proceed with installation? [Y/n] n

Take a look at

replace it with

ebrilo commented on 2017-01-15 13:53

>Hi I read that Dobo wanted to update the package january 13 but there is still no update on 15

You gotta be kidding..

Last Updated: 2017-01-13 23:54

fausterjames commented on 2017-01-15 13:15

Hi I read that Dobo wanted to update the package january 13 but there is still no update on 15. Do you guys know if this package is going to be uptaded ? If not could you point me to how to uninstall it in order to install freetype2 as when I try to do so I get :

`:: freetype2 and freetype2-infinality are in conflict. Remove freetype2-infinality? [y/N] y
error: failed to prepare transaction (could not satisfy dependencies)
:: fontconfig-infinality: removing freetype2-infinality breaks dependency 'freetype2-infinality'
:: grip-git: removing freetype2-infinality breaks dependency 'freetype2-infinality'`

Ralf_Mardorf commented on 2017-01-14 19:52

Read the comments!

This was several times explained by the comments.

Read the Wiki!

validpgpkeys is basic PKGBUILD knowledge, let alone that this topic was part of the latest checksum discussion.

Aco commented on 2017-01-14 18:30

what is wrong..

Wats Verifying source file signatures with gpg...
freetype-2.7.1.tar.bz2 ... FAILED (unknown public key C1A60EACE707FDA5)
freetype-doc-2.7.1.tar.bz2 ... FAILED (unknown public key C1A60EACE707FDA5)
ft2demos-2.7.1.tar.bz2 ... FAILED (unknown public key C1A60EACE707FDA5)
==> ERROR: One or more PGP signatures could not be verified!
==> ERROR: Makepkg was unable to build freetype2-infinality.

dobo commented on 2017-01-13 14:00

I will update tonight. I was quite busy last days.