Package Base Details: darling-git

Git Clone URL: https://aur.archlinux.org/darling-git.git (read-only, click to copy)
Keywords: Darwin Emulator macOS OSX Wine
Submitter: Xorg
Maintainer: jamesbrink
Last Packager: jamesbrink
Votes: 34
Popularity: 0.001098
First Submitted: 2013-06-29 15:19
Last Updated: 2020-07-26 04:35

Pinned Comments

jamesbrink commented on 2019-07-10 02:27

Please use this package for stable more reliable builds

https://aur.archlinux.org/packages/darling/

This one is identical but locked in on a last known working git ref and I will update as often as I can.

I have also raised an issue about versioning so maybe we can get some kind of tags for future versions and stable working builds

https://github.com/darlinghq/darling/issues/537

Latest Comments

« First ‹ Previous ... 4 5 6 7 8 9 10 11 12 13 14 Next › Last »

Xorg commented on 2016-02-27 20:05

@wenLiangcan: it's fixed in 1183.abf5770f. ;)

Xorg commented on 2016-02-27 12:01

I don't know which package update cause this issue. :/
It seems it's related to 32-bit build only.

wenLiangcan commented on 2016-02-27 11:58

So, we have to wait for the upstream patch again :)

Xorg commented on 2016-02-27 10:11

I have the same issue after updating my system...

wenLiangcan commented on 2016-02-27 01:31

The last generated pkgver is 1179.60f178e.

wenLiangcan commented on 2016-02-27 01:30

Failed to build again and got the same error outputs. : ( @Xorg

Xorg commented on 2016-02-27 00:17

@wenLiangcan: it seems to be fixed now (1179.60f178e).
I have no issue, and status on TC are good (http://teamcity.dolezel.info/project.html?projectId=Darling&tab=projectOverview). :)

wenLiangcan commented on 2016-02-26 13:10

Ok, got it, thanks for the reply.

Xorg commented on 2016-02-26 13:03

Build is broken at this time. I can't help you, I'm waiting for upstream patchs.

wenLiangcan commented on 2016-02-26 12:33

Failed to build:

[ 43%] Linking C shared library libsystem.so
clang-3.7: warning: argument unused during compilation: '-nostdinc'
/usr/lib32/libc.so.6:(*IND*+0x0): multiple definition of `scalbln'
/usr/lib32/libc.so.6:(*IND*+0x0): multiple definition of `scalblnf'
/usr/lib32/libc.so.6:(*IND*+0x0): multiple definition of `scalblnl'
clang-3.7: error: linker command failed with exit code 1 (use -v to see invocation)
src/libsystem/CMakeFiles/system.dir/build.make:165: recipe for target 'src/libsystem/libsystem.so' failed
make[2]: *** [src/libsystem/libsystem.so] Error 1
CMakeFiles/Makefile2:4179: recipe for target 'src/libsystem/CMakeFiles/system.dir/all' failed
make[1]: *** [src/libsystem/CMakeFiles/system.dir/all] Error 2
Makefile:149: recipe for target 'all' failed
make: *** [all] Error 2
==> ERROR: A failure occurred in build().
Aborting...