Package Details: zrythm 1.0.0-1

Git Clone URL: https://aur.archlinux.org/zrythm.git (read-only, click to copy)
Package Base: zrythm
Description: a highly automated and intuitive digital audio workstation
Upstream URL: https://www.zrythm.org
Keywords: audio daw
Licenses: AGPL3
Conflicts: zrythm-git
Submitter: alexteee
Maintainer: quenyen
Last Packager: quenyen
Votes: 8
Popularity: 0.77
First Submitted: 2019-01-01 17:00
Last Updated: 2020-10-16 20:43

Latest Comments

1 2 3 4 Next › Last »

dlupi commented on 2020-10-24 08:33

For me it compiles nice but there are few checks failed at the end, related to langages generation. These errors break the package creating. E.g. I'm not interested at all in af_ZA language... how can I fix it? I see it complains about writing to messages.mo, but why it is only in few cases and all the other languages are fine?

The output from the failed tests:

74/967 user-manual-af_ZA-projects.po FAIL 0.02s (exit status 1)

--- command --- 08:28:35 /usr/bin/msgfmt -v -c /mnt/usb/transcend/makepkg/tmp/zrythm/src/zrythm-1.0.0-alpha.4.0.1/build/../doc/user/locale/af_ZA/LC_MESSAGES/projects.po --- stderr --- /mnt/usb/transcend/makepkg/tmp/zrythm/src/zrythm-1.0.0-alpha.4.0.1/build/../doc/user/locale/af_ZA/LC_MESSAGES/projects.po:8: warning: header field 'PO-Revision-Date' still has the initial default value /mnt/usb/transcend/makepkg/tmp/zrythm/src/zrythm-1.0.0-alpha.4.0.1/build/../doc/user/locale/af_ZA/LC_MESSAGES/projects.po:8: warning: header field 'Last-Translator' still has the initial default value /mnt/usb/transcend/makepkg/tmp/zrythm/src/zrythm-1.0.0-alpha.4.0.1/build/../doc/user/locale/af_ZA/LC_MESSAGES/projects.po:8: warning: header field 'Language-Team' still has the initial default value /mnt/usb/transcend/makepkg/tmp/zrythm/src/zrythm-1.0.0-alpha.4.0.1/build/../doc/user/locale/af_ZA/LC_MESSAGES/projects.po:8: warning: header field 'Language' missing in header /usr/bin/msgfmt: error while writing "messages.mo" file: Operation not permitted -------

338/967 user-manual-fr-projects.po FAIL 0.03s (exit status 1)

--- command --- 08:28:37 /usr/bin/msgfmt -v -c /mnt/usb/transcend/makepkg/tmp/zrythm/src/zrythm-1.0.0-alpha.4.0.1/build/../doc/user/locale/fr/LC_MESSAGES/projects.po --- stderr --- /usr/bin/msgfmt: error while writing "messages.mo" file: Operation not permitted -------

476/967 user-manual-it-theming.po FAIL 0.03s (exit status 1)

--- command --- 08:28:38 /usr/bin/msgfmt -v -c /mnt/usb/transcend/makepkg/tmp/zrythm/src/zrythm-1.0.0-alpha.4.0.1/build/../doc/user/locale/it/LC_MESSAGES/theming.po --- stderr --- /mnt/usb/transcend/makepkg/tmp/zrythm/src/zrythm-1.0.0-alpha.4.0.1/build/../doc/user/locale/it/LC_MESSAGES/theming.po:8: warning: header field 'PO-Revision-Date' still has the initial default value /mnt/usb/transcend/makepkg/tmp/zrythm/src/zrythm-1.0.0-alpha.4.0.1/build/../doc/user/locale/it/LC_MESSAGES/theming.po:8: warning: header field 'Last-Translator' still has the initial default value /mnt/usb/transcend/makepkg/tmp/zrythm/src/zrythm-1.0.0-alpha.4.0.1/build/../doc/user/locale/it/LC_MESSAGES/theming.po:8: warning: header field 'Language-Team' still has the initial default value /mnt/usb/transcend/makepkg/tmp/zrythm/src/zrythm-1.0.0-alpha.4.0.1/build/../doc/user/locale/it/LC_MESSAGES/theming.po:8: warning: header field 'Language' missing in header /usr/bin/msgfmt: error while writing "messages.mo" file: Operation not permitted -------

740/967 user-manual-pt-theming.po FAIL 0.03s (exit status 1)

--- command --- 08:28:39 /usr/bin/msgfmt -v -c /mnt/usb/transcend/makepkg/tmp/zrythm/src/zrythm-1.0.0-alpha.4.0.1/build/../doc/user/locale/pt/LC_MESSAGES/theming.po --- stderr --- /mnt/usb/transcend/makepkg/tmp/zrythm/src/zrythm-1.0.0-alpha.4.0.1/build/../doc/user/locale/pt/LC_MESSAGES/theming.po:8: warning: header field 'PO-Revision-Date' still has the initial default value /mnt/usb/transcend/makepkg/tmp/zrythm/src/zrythm-1.0.0-alpha.4.0.1/build/../doc/user/locale/pt/LC_MESSAGES/theming.po:8: warning: header field 'Last-Translator' still has the initial default value /mnt/usb/transcend/makepkg/tmp/zrythm/src/zrythm-1.0.0-alpha.4.0.1/build/../doc/user/locale/pt/LC_MESSAGES/theming.po:8: warning: header field 'Language-Team' still has the initial default value /mnt/usb/transcend/makepkg/tmp/zrythm/src/zrythm-1.0.0-alpha.4.0.1/build/../doc/user/locale/pt/LC_MESSAGES/theming.po:8: warning: header field 'Language' missing in header /usr/bin/msgfmt: error while writing "messages.mo" file: Operation not permitted -------

938/967 user-manual-zh_TW-getting-started.po FAIL 0.03s (exit status 1)

--- command --- 08:28:41 /usr/bin/msgfmt -v -c /mnt/usb/transcend/makepkg/tmp/zrythm/src/zrythm-1.0.0-alpha.4.0.1/build/../doc/user/locale/zh_TW/LC_MESSAGES/getting-started.po --- stderr --- /usr/bin/msgfmt: error while writing "messages.mo" file: Operation not permitted -------

Summary of Failures:

74/967 user-manual-af_ZA-projects.po FAIL 0.02s (exit status 1) 338/967 user-manual-fr-projects.po FAIL 0.03s (exit status 1) 476/967 user-manual-it-theming.po FAIL 0.03s (exit status 1) 740/967 user-manual-pt-theming.po FAIL 0.03s (exit status 1) 938/967 user-manual-zh_TW-getting-started.po FAIL 0.03s (exit status 1)

Ok: 962 Expected Fail: 0
Fail: 5
Unexpected Pass: 0
Skipped: 0
Timeout: 0

blue commented on 2020-10-18 22:21

The build fails without cmake. Could you please add 'cmake' into makedepends?

quenyen commented on 2020-10-16 20:45

okay I added rubberband dependency ther is now an additional dependency on python-sphinx-intl which did not exist so I created it on the aur and then including it as a dependency in this package I do not know....

quenyen commented on 2020-10-16 19:09

I am running into additional issues on the package....there is now a dependency additional dependencies

sramey40 commented on 2020-09-18 21:00

Build fails because "rubberband" dependency is missing.

Run-time dependency lsp-dsp-lib found: NO (tried pkgconfig and cmake) Run-time dependency threads found: YES Run-time dependency sratom-0 found: YES 0.6.4 Run-time dependency serd-0 found: YES 0.30.4 Run-time dependency sord-0 found: YES 0.16.4 Dependency samplerate found: YES 0.1.9 (cached) Run-time dependency rubberband found: NO (tried pkgconfig and cmake)

meson.build:702:0: ERROR: Dependency "rubberband" not found, tried pkgconfig and cmake

A full log can be found at /home/sean/.cache/yay/zrythm/src/zrythm-0.8.911/build/meson-logs/meson-log.txt ==> ERROR: A failure occurred in build(). Aborting...

installing rubberband manually fixes the issue.

EDIT: So, upon installing and running, there is a fatal issue because it can't find gtksourceview3. I installed it manually and it works. Seems that rubberband needs to be fixed, and gtksourceview3 needs to be added as a dependency.

kimina commented on 2020-09-10 09:08

if you run into issues with the GPG, go grab it from the official site, save it as a file in the directory and do this,

gpg --import gpg key file

ashka commented on 2020-08-22 10:35

Meson 55 is now available in the arch repositories and may be used again in the PKGBUILD.

quenyen commented on 2020-08-14 14:44

Okay I looked into updating to the most current build of zrythm, I do not know about those guys but most projects that are iterating on the last number are simply numbering new builds from their CI instance. If they are introducing new features in new builds then that is pretty unusual. In any case the newest build requires meson 55 which is not yet present in the arch repositories universally. Until meson version 55 becomes the standard updating to the newest builds is not going to happen because it will result in general breakage.

StuckUpCreations commented on 2020-08-14 06:53

pgp key needs to be imported manually.. key is on zrythm's page

trilader commented on 2020-07-24 16:17

I build my packages in a chroot with aurutils and discovered that zrythm needs some additional builddeps: xdg-utils git and also as a regular dependency: rubberband in order to build.