Package Details: xlunch-git 4.7.1.r0.g020ea10-1

Git Clone URL: (read-only, click to copy)
Package Base: xlunch-git
Description: Graphical app launcher for X with few dependencies
Upstream URL:
Licenses: GPL3
Conflicts: xlunch
Provides: xlunch
Submitter: DragonX256
Maintainer: PMunch
Last Packager: PMunch
Votes: 2
Popularity: 0.000000
First Submitted: 2017-01-25 14:57
Last Updated: 2021-08-09 11:35

Latest Comments

« First ‹ Previous 1 2

flaketill commented on 2017-09-12 22:19


mkdir -p /tmp/yaourt-tmp-martin/aur-xlunch-git/pkg/xlunch-git//etc/xlunch/
mkdir -p /tmp/yaourt-tmp-martin/aur-xlunch-git/pkg/xlunch-git//usr/share/xlunch/svgicons/
mkdir -p /tmp/yaourt-tmp-martin/aur-xlunch-git/pkg/xlunch-git//usr/bin/
cp extra/ghost.png /tmp/yaourt-tmp-martin/aur-xlunch-git/pkg/xlunch-git//usr/share/icons/hicolor/48x48apps/xlunch_ghost.png
cp: no se puede crear el fichero regular '/tmp/yaourt-tmp-martin/aur-xlunch-git/pkg/xlunch-git//usr/share/icons/hicolor/48x48/apps/xlunch_ghost.png': No existe el fichero o el directorio
make: *** [Makefile:12: install] Error 1
==> ERROR: Se produjo un fallo en package().
==> ERROR: Makepkg no ha podido compilar xlunch-git.
==> ¿Reiniciar la compilación de xlunch-git? [s/N]

flaketill commented on 2017-09-12 05:44

On PKGBUILD missing 2 files

line 39 and 40

install -Dm755 extra/genconf "$pkgdir"/usr/bin/xlunch-genconf
install -Dm755 extra/sample_config.cfg "$pkgdir"/etc/xlunch/icons.conf

On the package not exist extra/genconf and extra/sample_config.cfg

DragonX256 commented on 2017-09-07 07:14

I had disowned this package, but this error is even not my own. @eggze, you can wait for updates from repo, but some parts of this package is out-of-date, since these guys have reworked again their config generation script.

eggze commented on 2017-09-07 07:08

The latest version ends with the following error:

==> Starting build()...
gcc xlunch.c -o xlunch -lImlib2 -lX11 -march=x86-64 -mtune=generic -O2 -pipe -fstack-protector-strong -fno-plt
xlunch.c: In function ‘init’:
xlunch.c:1214:17: error: expected ‘;’ before ‘fprintf’
fprintf (stderr," -R, --reverse All entries in xlunch as reversly ordered.\n");
make: *** [Makefile:33: xlunch] Error 1
==> ERROR: A failure occurred in build().