Package Details: wine-unity3d-git 1.7.38.r69.g862d7da-1

Git Clone URL: https://aur.archlinux.org/wine-unity3d-git.git (read-only)
Package Base: wine-unity3d-git
Description: A compatibility layer for running Windows programs, with patches to make unity3d '-force-opengl' work.
Upstream URL: http://www.winehq.com
Licenses: LGPL
Conflicts: bin32-wine, wine-wow64
Provides: wine=
Replaces: bin32-wine
Submitter: feilen
Maintainer: feilen
Last Packager: feilen
Votes: 3
Popularity: 0.000008
First Submitted: 2015-03-11 01:32
Last Updated: 2016-03-15 05:58

Dependencies (120)

Required by (145)

Sources (3)

Latest Comments

dfjigdfijgojio commented on 2017-07-24 11:24

Why can not install unity3d?
How can fix?

...
...
...
...
dictionary.o filesystem.o scrrun.o scrrun.res scrrun_t.res -luuid -loleaut32 -lversion -ladvapi32 \
-lwine ../../libs/port/libwine_port.a -Wl,-O1,--sort-common,--as-needed,-z,relro,-z,now
../../tools/winegcc/winegcc -o scrrun.dll.fake -B../../tools/winebuild -m64 -fasynchronous-unwind-tables -shared ../../../wine-unity3d-git/dlls/scrrun/scrrun.spec \
dictionary.o filesystem.o scrrun.o scrrun.res scrrun_t.res -luuid -loleaut32 -lversion -ladvapi32 \
-lwine ../../libs/port/libwine_port.a -Wl,-O1,--sort-common,--as-needed,-z,relro,-z,now
make[1]: Leaving directory '/tmp/yaourt-tmp-max/aur-wine-unity3d-git/src/wine-unity3d-git-64-build/dlls/scrrun'
./tools/makedep dlls/scrrun/tests
make[1]: Entering directory '/tmp/yaourt-tmp-max/aur-wine-unity3d-git/src/wine-unity3d-git-64-build/dlls/scrrun/tests'
../../../tools/widl/widl -o scrrun.h -m64 -I. -I../../../../wine-unity3d-git/dlls/scrrun/tests \
-I../../../include -I../../../../wine-unity3d-git/include -D__WINESRC__ \
../../../../wine-unity3d-git/dlls/scrrun/tests/scrrun.idl
gcc -c -o dictionary.o ../../../../wine-unity3d-git/dlls/scrrun/tests/dictionary.c -I. \
-I../../../../wine-unity3d-git/dlls/scrrun/tests -I../../../include \
-I../../../../wine-unity3d-git/include -D__WINESRC__ -D_REENTRANT -fPIC -Wall -pipe \
-fno-strict-aliasing -Wdeclaration-after-statement -Wempty-body -Wignored-qualifiers \
-Wshift-overflow=2 -Wstrict-prototypes -Wtype-limits -Wunused-but-set-parameter -Wvla \
-Wwrite-strings -Wpointer-arith -Wlogical-op -D_FORTIFY_SOURCE=0 -march=x86-64 -mtune=generic -O2 -pipe -fstack-protector-strong -fno-plt
../../../../wine-unity3d-git/dlls/scrrun/tests/dictionary.c: In function ‘test_comparemode’:
../../../../wine-unity3d-git/dlls/scrrun/tests/dictionary.c:104:1: warning: this ‘if’ clause does not guard... [-Wmisleading-indentation]
if (0) /* crashes on native */
^~
../../../../wine-unity3d-git/dlls/scrrun/tests/dictionary.c:107:5: note: ...this statement, but the latter is misleadingly indented as if it were guarded by the ‘if’
method = 10;
^~~~~~
../../../../wine-unity3d-git/dlls/scrrun/tests/dictionary.c: In function ‘test_IEnumVARIANT’:
../../../../wine-unity3d-git/dlls/scrrun/tests/dictionary.c:936:1: warning: this ‘if’ clause does not guard... [-Wmisleading-indentation]
if (0) /* crashes on native */
^~
../../../../wine-unity3d-git/dlls/scrrun/tests/dictionary.c:939:5: note: ...this statement, but the latter is misleadingly indented as if it were guarded by the ‘if’
hr = IDictionary__NewEnum(dict, &enum1);
^~
gcc -c -o filesystem.o ../../../../wine-unity3d-git/dlls/scrrun/tests/filesystem.c -I. \
-I../../../../wine-unity3d-git/dlls/scrrun/tests -I../../../include \
-I../../../../wine-unity3d-git/include -D__WINESRC__ -D_REENTRANT -fPIC -Wall -pipe \
-fno-strict-aliasing -Wdeclaration-after-statement -Wempty-body -Wignored-qualifiers \
-Wshift-overflow=2 -Wstrict-prototypes -Wtype-limits -Wunused-but-set-parameter -Wvla \
-Wwrite-strings -Wpointer-arith -Wlogical-op -D_FORTIFY_SOURCE=0 -march=x86-64 -mtune=generic -O2 -pipe -fstack-protector-strong -fno-plt
gcc -c -o testlist.o testlist.c -I. -I../../../../wine-unity3d-git/dlls/scrrun/tests -I../../../include \
-I../../../../wine-unity3d-git/include -D__WINESRC__ -D_REENTRANT -fPIC -Wall -pipe \
-fno-strict-aliasing -Wdeclaration-after-statement -Wempty-body -Wignored-qualifiers \
-Wshift-overflow=2 -Wstrict-prototypes -Wtype-limits -Wunused-but-set-parameter -Wvla \
-Wwrite-strings -Wpointer-arith -Wlogical-op -D_FORTIFY_SOURCE=0 -march=x86-64 -mtune=generic -O2 -pipe -fstack-protector-strong -fno-plt
../../../tools/winegcc/winegcc -o scrrun_test-stripped.exe.so -B../../../tools/winebuild -m64 -fasynchronous-unwind-tables \
-Wb,-F,scrrun_test.exe dictionary.o filesystem.o testlist.o -lole32 -lshlwapi -luuid -loleaut32 \
-luser32 -Wl,-O1,--sort-common,--as-needed,-z,relro,-z,now
echo "scrrun_test.exe TESTRES \"scrrun_test-stripped.exe.so\"" | ../../../tools/wrc/wrc -o ../../../programs/winetest/scrrun_test.res
../../../tools/winegcc/winegcc -o scrrun_test.exe.so -B../../../tools/winebuild -m64 -fasynchronous-unwind-tables \
dictionary.o filesystem.o testlist.o -lole32 -lshlwapi -luuid -loleaut32 -luser32 -Wl,-O1,--sort-common,--as-needed,-z,relro,-z,now
make[1]: Leaving directory '/tmp/yaourt-tmp-max/aur-wine-unity3d-git/src/wine-unity3d-git-64-build/dlls/scrrun/tests'
./tools/makedep dlls/scsiport.sys
make[1]: Entering directory '/tmp/yaourt-tmp-max/aur-wine-unity3d-git/src/wine-unity3d-git-64-build/dlls/scsiport.sys'
gcc -c -o scsiport.o ../../../wine-unity3d-git/dlls/scsiport.sys/scsiport.c -I. \
-I../../../wine-unity3d-git/dlls/scsiport.sys -I../../include -I../../../wine-unity3d-git/include \
-D__WINESRC__ -D_REENTRANT -fPIC -Wall -pipe -fno-strict-aliasing -Wdeclaration-after-statement \
-Wempty-body -Wignored-qualifiers -Wshift-overflow=2 -Wstrict-prototypes -Wtype-limits \
-Wunused-but-set-parameter -Wvla -Wwrite-strings -Wpointer-arith -Wlogical-op -D_FORTIFY_SOURCE=0 \
-march=x86-64 -mtune=generic -O2 -pipe -fstack-protector-strong -fno-plt
../../tools/winegcc/winegcc -o scsiport.sys.so -B../../tools/winebuild -m64 -fasynchronous-unwind-tables -shared ../../../wine-unity3d-git/dlls/scsiport.sys/scsiport.sys.spec \
-Wb,--subsystem,native scsiport.o -lntoskrnl.exe -lwine ../../libs/port/libwine_port.a -Wl,-O1,--sort-common,--as-needed,-z,relro,-z,now
../../tools/winegcc/winegcc -o scsiport.sys.fake -B../../tools/winebuild -m64 -fasynchronous-unwind-tables -shared ../../../wine-unity3d-git/dlls/scsiport.sys/scsiport.sys.spec \
-Wb,--subsystem,native scsiport.o -lntoskrnl.exe -lwine ../../libs/port/libwine_port.a -Wl,-O1,--sort-common,--as-needed,-z,relro,-z,now
make[1]: Leaving directory '/tmp/yaourt-tmp-max/aur-wine-unity3d-git/src/wine-unity3d-git-64-build/dlls/scsiport.sys'
make[1]: Entering directory '/tmp/yaourt-tmp-max/aur-wine-unity3d-git/src/wine-unity3d-git-64-build/dlls/secur32'
gcc -c -o base64_codec.o ../../../wine-unity3d-git/dlls/secur32/base64_codec.c -I. \
-I../../../wine-unity3d-git/dlls/secur32 -I../../include -I../../../wine-unity3d-git/include \
-I/usr/include/p11-kit-1 -D__WINESRC__ -D_REENTRANT -fPIC -Wall -pipe -fno-strict-aliasing \
-Wdeclaration-after-statement -Wempty-body -Wignored-qualifiers -Wshift-overflow=2 \
-Wstrict-prototypes -Wtype-limits -Wunused-but-set-parameter -Wvla -Wwrite-strings -Wpointer-arith \
-Wlogical-op -D_FORTIFY_SOURCE=0 -march=x86-64 -mtune=generic -O2 -pipe -fstack-protector-strong -fno-plt
gcc -c -o dispatcher.o ../../../wine-unity3d-git/dlls/secur32/dispatcher.c -I. \
-I../../../wine-unity3d-git/dlls/secur32 -I../../include -I../../../wine-unity3d-git/include \
-I/usr/include/p11-kit-1 -D__WINESRC__ -D_REENTRANT -fPIC -Wall -pipe -fno-strict-aliasing \
-Wdeclaration-after-statement -Wempty-body -Wignored-qualifiers -Wshift-overflow=2 \
-Wstrict-prototypes -Wtype-limits -Wunused-but-set-parameter -Wvla -Wwrite-strings -Wpointer-arith \
-Wlogical-op -D_FORTIFY_SOURCE=0 -march=x86-64 -mtune=generic -O2 -pipe -fstack-protector-strong -fno-plt
gcc -c -o hmac_md5.o ../../../wine-unity3d-git/dlls/secur32/hmac_md5.c -I. \
-I../../../wine-unity3d-git/dlls/secur32 -I../../include -I../../../wine-unity3d-git/include \
-I/usr/include/p11-kit-1 -D__WINESRC__ -D_REENTRANT -fPIC -Wall -pipe -fno-strict-aliasing \
-Wdeclaration-after-statement -Wempty-body -Wignored-qualifiers -Wshift-overflow=2 \
-Wstrict-prototypes -Wtype-limits -Wunused-but-set-parameter -Wvla -Wwrite-strings -Wpointer-arith \
-Wlogical-op -D_FORTIFY_SOURCE=0 -march=x86-64 -mtune=generic -O2 -pipe -fstack-protector-strong -fno-plt
gcc -c -o lsa.o ../../../wine-unity3d-git/dlls/secur32/lsa.c -I. \
-I../../../wine-unity3d-git/dlls/secur32 -I../../include -I../../../wine-unity3d-git/include \
-I/usr/include/p11-kit-1 -D__WINESRC__ -D_REENTRANT -fPIC -Wall -pipe -fno-strict-aliasing \
-Wdeclaration-after-statement -Wempty-body -Wignored-qualifiers -Wshift-overflow=2 \
-Wstrict-prototypes -Wtype-limits -Wunused-but-set-parameter -Wvla -Wwrite-strings -Wpointer-arith \
-Wlogical-op -D_FORTIFY_SOURCE=0 -march=x86-64 -mtune=generic -O2 -pipe -fstack-protector-strong -fno-plt
gcc -c -o negotiate.o ../../../wine-unity3d-git/dlls/secur32/negotiate.c -I. \
-I../../../wine-unity3d-git/dlls/secur32 -I../../include -I../../../wine-unity3d-git/include \
-I/usr/include/p11-kit-1 -D__WINESRC__ -D_REENTRANT -fPIC -Wall -pipe -fno-strict-aliasing \
-Wdeclaration-after-statement -Wempty-body -Wignored-qualifiers -Wshift-overflow=2 \
-Wstrict-prototypes -Wtype-limits -Wunused-but-set-parameter -Wvla -Wwrite-strings -Wpointer-arith \
-Wlogical-op -D_FORTIFY_SOURCE=0 -march=x86-64 -mtune=generic -O2 -pipe -fstack-protector-strong -fno-plt
gcc -c -o ntlm.o ../../../wine-unity3d-git/dlls/secur32/ntlm.c -I. \
-I../../../wine-unity3d-git/dlls/secur32 -I../../include -I../../../wine-unity3d-git/include \
-I/usr/include/p11-kit-1 -D__WINESRC__ -D_REENTRANT -fPIC -Wall -pipe -fno-strict-aliasing \
-Wdeclaration-after-statement -Wempty-body -Wignored-qualifiers -Wshift-overflow=2 \
-Wstrict-prototypes -Wtype-limits -Wunused-but-set-parameter -Wvla -Wwrite-strings -Wpointer-arith \
-Wlogical-op -D_FORTIFY_SOURCE=0 -march=x86-64 -mtune=generic -O2 -pipe -fstack-protector-strong -fno-plt
gcc -c -o schannel.o ../../../wine-unity3d-git/dlls/secur32/schannel.c -I. \
-I../../../wine-unity3d-git/dlls/secur32 -I../../include -I../../../wine-unity3d-git/include \
-I/usr/include/p11-kit-1 -D__WINESRC__ -D_REENTRANT -fPIC -Wall -pipe -fno-strict-aliasing \
-Wdeclaration-after-statement -Wempty-body -Wignored-qualifiers -Wshift-overflow=2 \
-Wstrict-prototypes -Wtype-limits -Wunused-but-set-parameter -Wvla -Wwrite-strings -Wpointer-arith \
-Wlogical-op -D_FORTIFY_SOURCE=0 -march=x86-64 -mtune=generic -O2 -pipe -fstack-protector-strong -fno-plt
gcc -c -o schannel_gnutls.o ../../../wine-unity3d-git/dlls/secur32/schannel_gnutls.c -I. \
-I../../../wine-unity3d-git/dlls/secur32 -I../../include -I../../../wine-unity3d-git/include \
-I/usr/include/p11-kit-1 -D__WINESRC__ -D_REENTRANT -fPIC -Wall -pipe -fno-strict-aliasing \
-Wdeclaration-after-statement -Wempty-body -Wignored-qualifiers -Wshift-overflow=2 \
-Wstrict-prototypes -Wtype-limits -Wunused-but-set-parameter -Wvla -Wwrite-strings -Wpointer-arith \
-Wlogical-op -D_FORTIFY_SOURCE=0 -march=x86-64 -mtune=generic -O2 -pipe -fstack-protector-strong -fno-plt
../../../wine-unity3d-git/dlls/secur32/schannel_gnutls.c:45:12: error: conflicting types for ‘gnutls_cipher_get_block_size’
extern int gnutls_cipher_get_block_size(gnutls_cipher_algorithm_t algorithm);
^~~~~~~~~~~~~~~~~~~~~~~~~~~~
In file included from ../../../wine-unity3d-git/dlls/secur32/schannel_gnutls.c:28:0:
/usr/include/gnutls/crypto.h:59:10: note: previous declaration of ‘gnutls_cipher_get_block_size’ was here
unsigned gnutls_cipher_get_block_size(gnutls_cipher_algorithm_t algorithm) __GNUTLS_CONST__;
^~~~~~~~~~~~~~~~~~~~~~~~~~~~
make[1]: *** [Makefile:338: schannel_gnutls.o] Error 1
make[1]: Leaving directory '/tmp/yaourt-tmp-max/aur-wine-unity3d-git/src/wine-unity3d-git-64-build/dlls/secur32'
make: *** [Makefile:16451: dlls/secur32] Error 2
==> ERROR: A failure occurred in build().
Aborting...
==> ERROR: Makepkg was unable to build wine-unity3d-git.
==> Restart building wine-unity3d-git ? [y/N]
==> -----------------------------------------
==>


Why can not install unity3d?
How can fix?

dfjigdfijgojio commented on 2017-07-23 09:15

How can fix this?

$ yaourt Unity3D
1 aur/wine-unity3d-git 1.7.38.r69.g862d7da-1 (3) (0.00)
A compatibility layer for running Windows programs, with patches to make
unity3d '-force-opengl' work.
==> Enter n° of packages to be installed (ex: 1 2 3 or 1-3)
==> -------------------------------------------------------
==> 1


==> Downloading wine-unity3d-git PKGBUILD from AUR...
x .SRCINFO
x 30-win32-aliases.conf
x PKGBUILD
x wine-git.install
wine-unity3d-git 1.7.38.r69.g862d7da-1 (2016-03-15 05:58)
( Unsupported package: Potentially dangerous ! )
==> Edit PKGBUILD ? [Y/n] ("A" to abort)
==> ------------------------------------
==> n

==> wine-unity3d-git dependencies:
- autoconf (already installed) [makedepend]
- ncurses (already installed) [makedepend]
- bison (already installed) [makedepend]
- perl (already installed) [makedepend]
- flex (already installed) [makedepend]
- gcc>=4.5.0-2 (already installed) [makedepend]
- giflib (already installed) [makedepend]
- libpng (already installed) [makedepend]
- lib32-libpng (already installed) [makedepend]
- gnutls (already installed) [makedepend]
- libxinerama (already installed) [makedepend]
- libxcomposite (already installed) [makedepend]
- libxmu (already installed) [makedepend]
- libxxf86vm (already installed) [makedepend]
- lib32-libxxf86vm (already installed) [makedepend]
- libxml2 (already installed) [makedepend]
- lib32-libxml2 (already installed) [makedepend]
- libldap (already installed) [makedepend]
- lcms (already installed) [makedepend]
- mpg123 (already installed) [makedepend]
- openal (already installed) [makedepend]
- v4l-utils (already installed) [makedepend]
- alsa-lib (already installed) [makedepend]
- libxcomposite (already installed) [makedepend]
- mesa (already installed) [makedepend]
- lib32-mesa (already installed) [makedepend]
- git (already installed) [makedepend]
- fontconfig (already installed) [makedepend]
- lib32-fontconfig (already installed) [makedepend]
- libxcursor (already installed) [makedepend]
- lib32-libxcursor (already installed) [makedepend]
- libxrandr (already installed) [makedepend]
- lib32-libxrandr (already installed) [makedepend]
- libxdamage (already installed) [makedepend]
- lib32-libxdamage (already installed) [makedepend]
- libxi (already installed) [makedepend]
- lib32-libxi (already installed) [makedepend]
- gettext (already installed) [makedepend]
- lib32-gettext (already installed) [makedepend]
- freetype2 (already installed) [makedepend]
- lib32-freetype2 (already installed) [makedepend]
- glu (already installed) [makedepend]
- lib32-glu (already installed) [makedepend]
- libsm (already installed) [makedepend]
- lib32-libsm (already installed) [makedepend]
- gcc-libs (already installed) [makedepend]
- lib32-gcc-libs (already installed) [makedepend]
- desktop-file-utils (already installed) [makedepend]
- fontforge (package found) [makedepend]
- prelink (building from AUR) [makedepend]
- gcc-multilib>=4.5.0-2 (package found) [makedepend]
- lib32-giflib (package found) [makedepend]
- lib32-gnutls (package found) [makedepend]
- lib32-libxinerama (package found) [makedepend]
- lib32-libxcomposite (package found) [makedepend]
- lib32-libxmu (package found) [makedepend]
- lib32-libldap (package found) [makedepend]
- lib32-lcms (package found) [makedepend]
- lib32-mpg123 (package found) [makedepend]
- lib32-openal (package found) [makedepend]
- lib32-v4l-utils (package found) [makedepend]
- lib32-alsa-lib (package found) [makedepend]
- lib32-libxcomposite (package found) [makedepend]
- samba (package found) [makedepend]


==> Edit wine-git.install ? [Y/n] ("A" to abort)
==> --------------------------------------------
n

==> Continue building wine-unity3d-git ? [Y/n]
==> ------------------------------------------
==> y

==> Building and installing package
==> Install or build missing dependencies for wine-unity3d-git:
resolving dependencies...
looking for conflicting packages...
:: gcc-multilib and gcc are in conflict. Remove gcc? [y/N]
:: gcc-libs-multilib and gcc-libs are in conflict. Remove gcc-libs? [y/N]

should remove `gcc` and `gcc-libs`?

How can fix this?