Package Details: vboot-utils 89.13729-1

Git Clone URL: (read-only, click to copy)
Package Base: vboot-utils
Description: Chromium OS verified boot utilities
Upstream URL:
Licenses: custom:chromiumos
Submitter: tsowell
Maintainer: anatolik
Last Packager: anatolik
Votes: 3
Popularity: 0.000000
First Submitted: 2013-10-30 03:16
Last Updated: 2021-02-26 17:52

Latest Comments

anatolik commented on 2020-05-28 02:24

@Satyrn it should be fixed now. PTAL.

anatolik commented on 2020-05-28 02:24

@Satyrn it should be fixed now. PTAL.

Satyrn commented on 2020-05-27 22:01

Getting multiple "first defined here" errors.

alexf91 commented on 2020-03-10 22:42

The validity check fails.

billypilgrim commented on 2019-07-12 22:49

The build's currently failing for me: firmware/lib/vboot_api_kernel.c: In function ‘vb2_kernel_setup’: firmware/lib/vboot_api_kernel.c:330:25: error: taking address of packed member of ‘struct VbSharedDataHeader’ may result in an unaligned pointer value [-Werror=address-of-packed-member] 330 | if (RollbackKernelRead(&shared->kernel_version_tpm)) { |

For some reason they've got -Werror enabled, so you could disable it like this: sed -i 's/-Werror//g' Makefile

triebefx commented on 2017-10-14 12:10

I cannot compile this package, getting this error, can anyone help please?

CC host/lib/signature_digest.o
host/lib/util_misc.c: In function ‘vb_keyb_from_rsa’:
host/lib/util_misc.c:68:38: error: dereferencing pointer to incomplete type ‘struct rsa_st’
nwords = BN_num_bits(rsa_private_key->n) / 32;
CC host/linktest/main.o
make: *** [Makefile:1169: /home/felix/Downloads/vboot-utils/src/build/host/lib/util_misc.o] Error 1
make: *** Waiting for unfinished jobs....
==> ERROR: A failure occurred in build().

stevenhoneyman commented on 2015-08-09 22:10

There's something strange with this:

==> Validating source files with sha1sums...
release-R45-7262.B.tar.gz ... FAILED
==> ERROR: One or more files did not pass the validity check!

The file I got (using yaourt):
b5975e681ff6b896b6d3a36b04cdfdc49ea8a67e release-R45-7262.B.tar.gz

The file I got (clicking on the link in "Sources" just above)
7adeeb2b201191fbb157207280dd148a1fdf84bf vboot_reference-refs_heads_release-R45-7262.B.tar.gz

and neither match the one in the PKGBUILD!

anatolik commented on 2014-12-21 12:21

Thanks. The issue was already fixed upstream. Pulling it from there.

stevenhoneyman commented on 2014-12-14 13:48

This is broken for a clean install - the tests rely on cgpt being in the path, but it hasn't been installed yet. if I make the test return true, it works fine after that to build again and test fully. Here's the bit where it goes wrong:

Bootloader address: 0x10a000
Bootloader size: 0x4000
Body verification succeeded.
Kernel verification succeeded
Creating test disk image
1024+0 records in
1024+0 records out
1048576 bytes (1.0 MB) copied, 0.000984174 s, 1.1 GB/s
tests/ line 61: cgpt: command not found
Makefile:1127: recipe for target 'runtestscripts' failed
make: *** [runtestscripts] Error 127
make: *** Waiting for unfinished jobs....
VerifyData() calculate signature Test PASSED
VerifyData() calculate rsa Test PASSED
VerifyData() ok Test PASSED

dfanz0r commented on 2014-07-26 23:14

Flagged out of date, the upstream url is outdated the current git repo is here:

The latest tagged release there is R37-5978.