Package Details: vapoursynth-plugin-fftspectrum-git r1.1.g0fe5160-2

Git Clone URL: https://aur.archlinux.org/vapoursynth-plugin-fftspectrum-git.git (read-only, click to copy)
Package Base: vapoursynth-plugin-fftspectrum-git
Description: Plugin for Vapoursynth: fftspectrum (GIT version)
Upstream URL: https://github.com/Beatrice-Raws/FFTSpectrum
Keywords: vapoursynth
Licenses: GPL
Conflicts: vapoursynth-plugin-fftspectrum
Provides: vapoursynth-plugin-fftspectrum
Submitter: sl1pkn07
Maintainer: sl1pkn07
Last Packager: sl1pkn07
Votes: 1
Popularity: 0.000000
First Submitted: 2019-03-02 20:04
Last Updated: 2021-10-25 18:13

Required by (0)

Sources (1)

Latest Comments

sl1pkn07 commented on 2021-10-25 18:28

try to add -msse4.1 in the https://aur.archlinux.org/cgit/aur.git/tree/PKGBUILD?h=vapoursynth-plugin-fftspectrum-git#n34 before -fPIC

Win8Error commented on 2021-10-25 18:23

I have a Intel Core i7 8750H.

sl1pkn07 commented on 2021-10-25 18:22

what is your processor?

Win8Error commented on 2021-10-25 18:16

Thank you for the update. But now it fails with following output:

==> Starting pkgver()...
==> Starting build()...
make: Entering directory '/build/vapoursynth-plugin-fftspectrum-git/src/fftspectrum'
gcc -c -fPIC -march=x86-64 -mtune=generic -O2 -pipe -fno-plt -D_FORTIFY_SOURCE=2 -I. -I/usr/include/vapoursynth  -o FFTSpectrum.o FFTSpectrum.c
In file included from /usr/lib/gcc/x86_64-pc-linux-gnu/11.1.0/include/immintrin.h:39,
                 from /usr/lib/gcc/x86_64-pc-linux-gnu/11.1.0/include/x86intrin.h:32,
                 from FFTSpectrum.c:38:
FFTSpectrum.c: In function ‘fill_fft_input_array’:
/usr/lib/gcc/x86_64-pc-linux-gnu/11.1.0/include/smmintrin.h:520:1: error: inlining failed in call to ‘always_inline’ ‘_mm_cvtepu8_epi32’: target specific option mismatch
  520 | _mm_cvtepu8_epi32 (__m128i __X)
      | ^~~~~~~~~~~~~~~~~
FFTSpectrum.c:79:32: note: called from here
   79 |                 epu32_buffer = _mm_cvtepu8_epi32(in_buffer);
      |                                ^~~~~~~~~~~~~~~~~~~~~~~~~~~~
make: *** [Makefile:2: all] Error 1
make: Leaving directory '/build/vapoursynth-plugin-fftspectrum-git/src/fftspectrum'
==> ERROR: A failure occurred in build().
    Aborting...
==> ERROR: Build failed, check /home/.archbuild/extra-x86_64/yuki/build

Win8Error commented on 2021-10-25 18:13

Sadly also this package fails to build.

==> Starting pkgver()...

==> Starting build()...

make: Entering directory '/build/vapoursynth-plugin-fftspectrum-git/src/fftspectrum'

gcc -c -fPIC -march=x86-64 -mtune=generic -O2 -pipe -fno-plt -D_FORTIFY_SOURCE=2 -I. -I/usr/include/vapoursynth  -o FFTSpectrum.o FFTSpectrum.c

In file included from /usr/lib/gcc/x86_64-pc-linux-gnu/11.1.0/include/immintrin.h:39,

                 from /usr/lib/gcc/x86_64-pc-linux-gnu/11.1.0/include/x86intrin.h:32,

                 from FFTSpectrum.c:38:

FFTSpectrum.c: In function ‘fill_fft_input_array’:

/usr/lib/gcc/x86_64-pc-linux-gnu/11.1.0/include/smmintrin.h:520:1: error: inlining failed in call to ‘always_inline’ ‘_mm_cvtepu8_epi32’: target specific option mismatch

  520 | _mm_cvtepu8_epi32 (__m128i __X)

      | ^~~~~~~~~~~~~~~~~

FFTSpectrum.c:79:32: note: called from here

   79 |                 epu32_buffer = _mm_cvtepu8_epi32(in_buffer);

      |                                ^~~~~~~~~~~~~~~~~~~~~~~~~~~~

make: *** [Makefile:2: all] Error 1

make: Leaving directory '/build/vapoursynth-plugin-fftspectrum-git/src/fftspectrum'

==> ERROR: A failure occurred in build().

    Aborting...

==> ERROR: Build failed, check /home/.archbuild/extra-x86_64/yuki/build

Win8Error commented on 2021-08-28 20:13

Build fails with following output:

==> Retrieving sources...
==> WARNING: Skipping all source file integrity checks.
==> Extracting sources...
  -> Creating working copy of fftspectrum git repo...
Cloning into 'fftspectrum'...
done.
==> Starting prepare()...
==> Starting pkgver()...
==> Starting build()...
make: Entering directory '/build/vapoursynth-plugin-fftspectrum-git/src/fftspectrum'
gcc -c -fPIC -march=x86-64 -mtune=generic -O2 -pipe -fno-plt -D_FORTIFY_SOURCE=2 -I. -I/usr/include/vapoursynth  -o FFTSpectrum.o FFTSpectrum.c
In file included from /usr/lib/gcc/x86_64-pc-linux-gnu/11.1.0/include/immintrin.h:39,
                 from /usr/lib/gcc/x86_64-pc-linux-gnu/11.1.0/include/x86intrin.h:32,
                 from FFTSpectrum.c:38:
FFTSpectrum.c: In function ‘fill_fft_input_array’:
/usr/lib/gcc/x86_64-pc-linux-gnu/11.1.0/include/smmintrin.h:520:1: error: inlining failed in call to ‘always_inline’ ‘_mm_cvtepu8_epi32’: target specific option mismatch
  520 | _mm_cvtepu8_epi32 (__m128i __X)
      | ^~~~~~~~~~~~~~~~~
FFTSpectrum.c:79:32: note: called from here
   79 |                 epu32_buffer = _mm_cvtepu8_epi32(in_buffer);
      |                                ^~~~~~~~~~~~~~~~~~~~~~~~~~~~
make: *** [Makefile:2: all] Error 1
make: Leaving directory '/build/vapoursynth-plugin-fftspectrum-git/src/fftspectrum'
==> ERROR: A failure occurred in build().
    Aborting...
==> ERROR: Build failed, check /home/.archbuild/extra-x86_64/yuki/build