Package Details: tuxguitar-common 1.5.2_r1800-3

Git Clone URL: https://aur.archlinux.org/tuxguitar.git (read-only)
Package Base: tuxguitar
Description: multitrack guitar tablature editor and player
Upstream URL: https://sourceforge.net/projects/tuxguitar/
Licenses: LGPL
Submitter: Barthalion
Maintainer: buzo
Last Packager: buzo
Votes: 33
Popularity: 2.575187
First Submitted: 2018-01-05 17:06
Last Updated: 2019-07-10 11:21

Latest Comments

1 2 3 4 5 Next › Last »

leuko commented on 2019-07-12 14:19

buzo: I still get the error that andmars got.

buzo commented on 2019-07-10 15:50

LeonardK: I tried that first, too, but it didn't work. Pacman installed two Java versions in the chroot: 12 for the first dependency and 11 for the second one. Then I still got that build error.

It turns out that this is a known pacman bug.

LeonardK commented on 2019-07-10 15:28

I'd rather prefer to have the dependency listed as :

'java-environment>=8' 'java-environment<12'

as described in https://wiki.archlinux.org/index.php/PKGBUILD#depends

This allows for different java editions to be used than OpenJDK and different versions than 11.

buzo commented on 2019-07-10 11:22

andmars: Thanks for the notice, should be fixed now.

andmars commented on 2019-07-09 13:37

[INFO] BUILD FAILURE [INFO] ------------------------------------------------------------------------ [INFO] Total time: 4.236 s [INFO] Finished at: 2019-07-09T15:36:44+02:00 [INFO] ------------------------------------------------------------------------ [ERROR] Failed to execute goal org.apache.maven.plugins:maven-compiler-plugin:2.3.2:compile (default-compile) on project tuxguitar-lib: Compilation failure: Compilation failure: [ERROR] error: Source option 6 is no longer supported. Use 7 or later. [ERROR] error: Target option 6 is no longer supported. Use 7 or later. [ERROR] -> [Help 1] [ERROR] [ERROR] To see the full stack trace of the errors, re-run Maven with the -e switch. [ERROR] Re-run Maven using the -X switch to enable full debug logging. [ERROR] [ERROR] For more information about the errors and possible solutions, please read the following articles: [ERROR] [Help 1] http://cwiki.apache.org/confluence/display/MAVEN/MojoFailureException ==> FEHLER: Ein Fehler geschah in build(). Breche ab...

raith commented on 2019-04-29 12:06

@rigczTheSky This is not a problem with this package. Please update your system and retry installing this package. From your comment I take, that pacman wants to install a version of apr that is outdated since at least 3 weeks (fluidsynth is outdated as well).

As a general tip for the future to prevent this kind of problem: Update your Arch Linux/Antergos/etc. at least once a week.

ThanosApostolou commented on 2019-04-28 21:09

I no longer have time to maintain this package, so I disown it. Please someone take over.

rigczTheSky commented on 2019-04-28 21:08

When i was trying to install then i've got an error:

Downloading apr (1.6.5-1-x86_64)... Downloading fluidsynth (2.0.4-1-x86_64)... Warning: failed to retrieve some files Downloading apr (1.6.5-1-x86_64)... Warning: failed to retrieve some files Failed to commit transaction: failed retrieving file 'apr-1.6.5-1-x86_64.pkg.tar.xz' from mirrors.tuna.tsinghua.edu.cn : The requested URL returned error: 404 Not Found

I am using Antergos with XFCE. I would be thankfull for Your help.

ThanosApostolou commented on 2019-03-20 12:43

@Popolon maven is listed as a makedepend and it builds fine in a clean chroot. What dependency do you mean?

Popolon commented on 2019-03-20 10:56

A build dependency with maven package is missing.