Package Details: transmission-sequential-gtk 2.94-2

Git Clone URL: https://aur.archlinux.org/transmission-sequential.git (read-only)
Package Base: transmission-sequential
Description: Fast, easy, and free BitTorrent client (GTK+ GUI) (+sequential patch)
Upstream URL: http://www.transmissionbt.com/
Keywords: torrent
Licenses: MIT
Conflicts: transmission-gtk
Provides: transmission-gtk
Submitter: Mikaye
Maintainer: Mikaye
Last Packager: Mikaye
Votes: 16
Popularity: 0.22
First Submitted: 2014-07-30 14:57
Last Updated: 2019-09-04 17:57

Required by (11)

Sources (4)

Latest Comments

1 2 3 Next › Last »

procobain commented on 2019-09-07 23:55

Could create package already with bin right? Here on my black screen arch need to download 500mb to compile.

Mikaye commented on 2019-09-04 18:03

The libevent error should be fixed (a simple rebuild)

There is no configuration in settings.json. The sequential switching is currently bugged (I need to fix this when I have time to investigate...) when using the right-click menu on webui but it works when using the buttons in the toolbar (at least for me). If it still not working, please open a ticket on GitHub (https://github.com/Mikayex/transmission)

procobain commented on 2019-08-22 11:01

Error after update of libevent

procobain commented on 2019-08-09 23:43

Need to configure any settings.json options?

I am entering the webui, I click Sequential download but the status is still NO.

How to make?

streetwalrus commented on 2017-12-11 23:44

For some reason the checksum on the tarball consistently fails for me, any idea why?

Mikaye commented on 2017-04-25 09:10

@jevv: Fixed
@enihcam: I don't have miniupnpc installed and it works... Maybe you had it installed while building the package (so it was using the system's miniupnpc) and you uninstalled it after, breaking the link...

enihcam commented on 2017-04-25 05:48

install transmission without miniupnpc, and you will get:
/usr/bin/transmission-daemon: error while loading shared libraries: libminiupnpc.so.16: cannot open shared object file: No such file or directory

je-vv commented on 2017-04-24 17:54

Needs patch from transmission-cli:

https://git.archlinux.org/svntogit/packages.git/plain/trunk/transmission-2.92-openssl-1.1.0.patch?h=packages/transmission

Needs rebuild against openssl 1.1.*, but it fails:

++++
crypto-utils-openssl.c: In function ‘tr_dh_new’:
crypto-utils-openssl.c:244:29: error: dereferencing pointer to incomplete type ‘DH {aka struct dh_st}’
if (!check_pointer (handle->p = BN_bin2bn (prime_num, prime_num_length, NULL)) ||
^
crypto-utils-openssl.c:92:56: note: in definition of macro ‘check_pointer’
#define check_pointer(pointer) check_openssl_pointer ((pointer), __FILE__, __LINE__)
^~~~~~~
make[1]: *** [Makefile:1251: crypto-utils-openssl.o] Error 1
make[1]: Leaving directory '/tmp/yaourt-tmp-vasqueja/aur-transmission-sequential-cli/src/transmission-2.92-seq/libtransmission'
make: *** [Makefile:509: all-recursive] Error 1
==> ERROR: A failure occurred in build().
++++

enihcam commented on 2016-05-10 15:57

yes it works.

Mikaye commented on 2016-05-10 13:19

I pushed the fix (but didn't tested, let me know if it works)
The package release number was not updated since it only affects the compilation.