Package Details: timeshift 19.08.1-1

Git Clone URL: (read-only)
Package Base: timeshift
Description: A system restore utility for Linux
Upstream URL:
Licenses: GPL
Submitter: severach
Maintainer: severach
Last Packager: severach
Votes: 74
Popularity: 3.699195
First Submitted: 2015-08-19 07:22
Last Updated: 2019-08-26 21:08

Latest Comments

« First ‹ Previous 1 2 3 4 5 6 Next › Last »

pumba commented on 2017-04-25 17:54

@severach I'm having problems to compile this package.

Gtk/ExcludeBox.vala:301.17-301.20: error: Argument 1: Cannot pass value to reference or output parameter
Gtk/RsyncLogWindow.vala:167.4-167.22: warning: GLib.Thread.create has been deprecated since 2.32. Use new Thread<T> ()
Compilation failed: 1 error(s), 21 warning(s)
make[1]: *** [makefile:27: all] Error 1
make: *** [makefile:2: all] Error 2
/usr/bin/makepkg: line 729: logpipe: unbound variable
warning: package timeshift failed to build, skipping

alesk commented on 2017-04-20 19:08

timeshift --restore
Failed to mount device...

crowja commented on 2017-01-29 01:30

seems invalid sha256sum for timeshift_v17.2_r429.tgz, works after changing PKGBUILD:


severach commented on 2016-07-14 16:07

Install Debian to a spare machine from the junk box. Install timeshift. If the check box problem is there too then you report to the developer. If not then look for differences between Arch and Debian.

Maxiride commented on 2016-07-14 11:12

@severach do you mean I need to switch linux distro? I don't get it :\

severach commented on 2016-07-07 08:19

Try installing Debian to see if your checkbox issue is fixed.

Maxiride commented on 2016-07-07 07:42

Got a couple of issue, don't know if I should report it to the software releaser or if an issue related to this package.

Settings-> Planned backups: I can only tick the options, clicking again won't untick the option

Always about planned backups I enabled the daily ones but after a week when I reopened timeshift no backups have been done.

Maxiride commented on 2016-06-25 07:23

@severach indeed, thank you very much. Install successful.

severach commented on 2016-06-24 17:13

Building in a clean chroot showed that vte3 is required.

Maxiride commented on 2016-06-24 16:22

Having the same error as @irishwoody plus some missing variable at the end of the compilation:

/tmp/yaourt-tmp-federico/aur-timeshift/src/~teejee2008/timeshift/trunk/src/TerminalWindow.vala.c:30:21: fatal error: vte/vte.h: File o directory non esistente
#include <vte/vte.h>
compilation terminated.
error: cc exited with status 256
Compilation failed: 1 error(s), 15 warning(s)
make[1]: *** [makefile:17: all] Error 1
make: *** [makefile:2: all] Error 2
/usr/bin/makepkg: riga 729: logpipe: variabile non assegnata ==> variable unassigned
==> ERRORE: Makepkg non è riuscito a compilare timeshift.
==> Riavviare la compilazione di timeshift [s/N]
==> --------------------------------------------