Package Details: textlint-plugin-asciidoc-loose 1.0.1-1

Git Clone URL: https://aur.archlinux.org/textlint-plugin-asciidoc-loose.git (read-only, click to copy)
Package Base: textlint-plugin-asciidoc-loose
Description: textlint plugin for asciidoc/asciidoctor
Upstream URL: https://github.com/azu/textlint-plugin-asciidoc-loose
Submitter: nemaniarjun
Maintainer: nemaniarjun
Last Packager: nemaniarjun
Votes: 0
Popularity: 0.000000
First Submitted: 2018-07-09 04:50
Last Updated: 2018-07-09 04:50

Latest Comments

dreieck commented on 2020-03-15 17:45

This package's PKGBUILD does compilation in package(). It should do so in build() instead:

==> Starting package()...

> oniguruma@6.2.1 install [...]/aur-textlint-plugin-asciidoc-loose/pkg/textlint-plugin-asciidoc-loose/usr/lib/node_modules/textlint-plugin-asciidoc-loose/node_modules/oniguruma
> node-gyp rebuild

make: Entering directory '[...]/aur-textlint-plugin-asciidoc-loose/pkg/textlint-plugin-asciidoc-loose/usr/lib/node_modules/textlint-plugin-asciidoc-loose/node_modules/oniguruma/build'
  CC(target) Release/obj.target/oniguruma/deps/onig/regcomp.o
  CC(target) Release/obj.target/oniguruma/deps/onig/regenc.o
  CC(target) Release/obj.target/oniguruma/deps/onig/regerror.o
[...]

Please fix and check also your other packages!

dreieck commented on 2020-03-15 17:44

Fails to build:

==> Starting package()...
[...]
make: *** [onig_scanner.target.mk:121: Release/obj.target/onig_scanner/src/onig-scanner.o] Error 1
make: Leaving directory '[...]/aur-textlint-plugin-asciidoc-loose/pkg/textlint-plugin-asciidoc-loose/usr/lib/node_modules/textlint-plugin-asciidoc-loose/node_modules/oniguruma/build'
gyp ERR! build error 
gyp ERR! stack Error: `make` failed with exit code: 2
gyp ERR! stack     at ChildProcess.onExit (/usr/lib/node_modules/node-gyp/lib/build.js:194:23)
gyp ERR! stack     at ChildProcess.emit (events.js:316:20)
gyp ERR! stack     at Process.ChildProcess._handle.onexit (internal/child_process.js:275:12)
gyp ERR! System Linux 5.2.6-pf4-phc-vfio
gyp ERR! command "/usr/bin/node" "/usr/lib/node_modules/node-gyp/bin/node-gyp.js" "rebuild"
gyp ERR! cwd [...]/aur-textlint-plugin-asciidoc-loose/pkg/textlint-plugin-asciidoc-loose/usr/lib/node_modules/textlint-plugin-asciidoc-loose/node_modules/oniguruma
gyp ERR! node -v v13.10.1
gyp ERR! node-gyp -v v6.1.0
gyp ERR! not ok 
npm ERR! code ELIFECYCLE
npm ERR! errno 1
npm ERR! oniguruma@6.2.1 install: `node-gyp rebuild`
npm ERR! Exit status 1
npm ERR! 
npm ERR! Failed at the oniguruma@6.2.1 install script.
npm ERR! This is probably not a problem with npm. There is likely additional logging output above.

npm ERR! A complete log of this run can be found in:
npm ERR!     [~]/.npm/_logs/2020-03-15T17_39_12_021Z-debug.log
==> ERROR: A failure occurred in package().
    Aborting...

The last lines of [~]/.npm/_logs/2020-03-15T17_39_12_021Z-debug.log:

[...]
219 info lifecycle nan@2.14.0~install: nan@2.14.0
220 silly install oniguruma@6.2.1
221 info lifecycle oniguruma@6.2.1~install: oniguruma@6.2.1
222 verbose lifecycle oniguruma@6.2.1~install: unsafe-perm in lifecycle false
223 verbose lifecycle oniguruma@6.2.1~install: PATH: /usr/lib/node_modules/npm/node_modules/npm-lifecycle/node-gyp-bin:[...]/aur-textlint-plugin-asciidoc-loose/pkg/textlint-plugin-asciidoc-loose/usr/lib/node_modules/textlint-plugin-asciidoc-loose/node_modules/oniguruma/node_modules/.bin:[...]/aur-textlint-plugin-asciidoc-loose/pkg/textlint-plugin-asciidoc-loose/usr/lib/node_modules/textlint-plugin-asciidoc-loose/node_modules/.bin:[...]/aur-textlint-plugin-asciidoc-loose/pkg/textlint-plugin-asciidoc-loose/usr/lib/node_modules/.bin:/usr/bin:/usr/X11R6/bin:/usr/bin/vendor_perl:/usr/local/sbin:/usr/local/bin:/usr/games:[~]/bin:[~]/local/bin:[~]/sbin:[~]/local/sbin
224 verbose lifecycle oniguruma@6.2.1~install: CWD: [...]/aur-textlint-plugin-asciidoc-loose/pkg/textlint-plugin-asciidoc-loose/usr/lib/node_modules/textlint-plugin-asciidoc-loose/node_modules/oniguruma
225 silly lifecycle oniguruma@6.2.1~install: Args: [ '-c', 'node-gyp rebuild' ]
226 silly lifecycle oniguruma@6.2.1~install: Returned: code: 1  signal: null
227 info lifecycle oniguruma@6.2.1~install: Failed to exec install script
228 timing action:install Completed in 29291ms
229 verbose unlock done using [~]/.npm/_locks/staging-338766ff866fd618.lock for [...]/aur-textlint-plugin-asciidoc-loose/pkg/textlint-plugin-asciidoc-loose/usr/lib/node_modules/.staging
230 timing stage:rollbackFailedOptional Completed in 230ms
231 timing stage:runTopLevelLifecycles Completed in 48543ms
232 verbose stack Error: oniguruma@6.2.1 install: `node-gyp rebuild`
232 verbose stack Exit status 1
232 verbose stack     at EventEmitter.<anonymous> (/usr/lib/node_modules/npm/node_modules/npm-lifecycle/index.js:332:16)
232 verbose stack     at EventEmitter.emit (events.js:316:20)
232 verbose stack     at ChildProcess.<anonymous> (/usr/lib/node_modules/npm/node_modules/npm-lifecycle/lib/spawn.js:55:14)
232 verbose stack     at ChildProcess.emit (events.js:316:20)
232 verbose stack     at maybeClose (internal/child_process.js:1026:16)
232 verbose stack     at Process.ChildProcess._handle.onexit (internal/child_process.js:286:5)
233 verbose pkgid oniguruma@6.2.1
234 verbose cwd [...]/aur-textlint-plugin-asciidoc-loose/pkg/textlint-plugin-asciidoc-loose/usr/lib/node_modules
235 verbose Linux 5.2.6-pf4-phc-vfio
236 verbose argv "/usr/bin/node" "/usr/bin/npm" "install" "-g" "--prefix" "[...]/aur-textlint-plugin-asciidoc-loose/pkg/textlint-plugin-asciidoc-loose/usr" "textlint-plugin-asciidoc-loose@1.0.1"
237 verbose node v13.10.1
238 verbose npm  v6.14.2
239 error code ELIFECYCLE
240 error errno 1
241 error oniguruma@6.2.1 install: `node-gyp rebuild`
241 error Exit status 1
242 error Failed at the oniguruma@6.2.1 install script.
242 error This is probably not a problem with npm. There is likely additional logging output above.
243 verbose exit [ 1, true ]