Package Details: synthpod-git 0.1.5625-1

Git Clone URL: (read-only)
Package Base: synthpod-git
Description: Lightweight non-linear plugin host
Upstream URL:
Licenses: Artistic2.0
Groups: lv2-plugins, lv2-hosts
Conflicts: synthpod
Provides: synthpod
Submitter: ventosus
Maintainer: ventosus
Last Packager: ventosus
Votes: 1
Popularity: 0.000001
First Submitted: 2015-11-23 20:19
Last Updated: 2018-04-11 21:52

Latest Comments

« First ‹ Previous 1 2

ventosus commented on 2018-03-10 21:11

zita-alsa-pcmi dependency fixed.

@milkmiruku, you seem to use jack2, right? The latter does not depend on zita-alsa-pcmi, so the package indeed needs an explicit dependency (for those running on jack2) for synthpod's alsa backend.

Thanks for reporting.

ventosus commented on 2018-03-05 08:29

zita-alsa-pcmi is implicitely included by jack, isn't it?

milk commented on 2018-03-04 12:12

needs the dependency of zita-alsa-pcmi

-- Looking for jack_get_cycle_times in jack - found
CMake Error at bin/CMakeLists.txt:76 (message):
  zita-alsa-pcmi not found

-- Configuring incomplete, errors occurred!
See also "/var/tmp/trizen-milk/synthpod-git/src/synthpod/build/CMakeFiles/CMakeOutput.log".
==> ERROR: A failure occurred in build().

ventosus commented on 2016-03-31 10:15


You've been most unlucky, trying to compile synthpod-git exactly between the introduction of new dependencies upstream and the needed adjustments to the PKGBUILD ;-)

cmt227 commented on 2016-03-30 20:00


When I try to build this package I get an error like this:

Scanning dependencies of target synthpod.alsa
[ 28%] Building CXX object bin/CMakeFiles/synthpod.alsa.dir/pcmi.cpp.o
[ 30%] Building C object bin/CMakeFiles/synthpod.alsa.dir/synthpod_alsa.c.o
[ 32%] Building C object bin/CMakeFiles/synthpod.alsa.dir/synthpod_nsm.c.o
[ 34%] Building C object bin/CMakeFiles/synthpod.alsa.dir/__/symap/symap.c.o
[ 36%] Linking CXX executable synthpod_alsa
../lib/ undefined reference to `sandbox_master_fd_get'
../lib/ undefined reference to `sandbox_master_flush'
../lib/ undefined reference to `sandbox_master_recv'
../lib/ undefined reference to `sandbox_master_new'
../lib/ undefined reference to `sandbox_master_free'
../lib/ undefined reference to `sandbox_master_send'
collect2: error: ld returned 1 exit status
bin/CMakeFiles/synthpod.alsa.dir/build.make:175: recipe for target 'bin/synthpod_alsa' failed
make[2]: *** [bin/synthpod_alsa] Error 1
CMakeFiles/Makefile2:260: recipe for target 'bin/CMakeFiles/synthpod.alsa.dir/all' failed
make[1]: *** [bin/CMakeFiles/synthpod.alsa.dir/all] Error 2
Makefile:149: recipe for target 'all' failed
make: *** [all] Error 2
==> ERROR: A failure occurred in build().

I believe I have all the correct dependencies installed. Thanks for any help you can provide.