Package Details: syncthingtray 0.11.12-1

Git Clone URL: (read-only, click to copy)
Package Base: syncthingtray
Description: Tray application for Syncthing
Upstream URL:
Licenses: GPL
Submitter: Martchus
Maintainer: Martchus
Last Packager: Martchus
Votes: 34
Popularity: 1.77
First Submitted: 2016-09-14 20:13
Last Updated: 2020-08-11 23:16

Pinned Comments

Martchus commented on 2016-10-31 11:39

All my packages are managed at GitHub where you can also contribute directly:
There also exist a binary repository:

Note that the tests of this package might fail despite there's nothing wrong (e. g. because Syncthing is just too slow and the test runs in a timeout). To ignore those false-positives, build the package with makepkg --nocheck or makechrootpkg -- --nocheck. It makes still sense to report failures. But please include the actual error message and not just the last few lines.

Latest Comments

1 2 Next › Last »

Martchus commented on 2020-07-07 22:05

@sez11a See comments on qtutilities and better add comments in the specific package which has the build errors.

sez11a commented on 2020-07-07 21:07

I get an error compiling qtutilities:

[ 91%] Building CXX object CMakeFiles/qtutilities.dir/qtutilities_autogen/3YJK5W5UP7/qrc_qtutilsicons.cpp.o
[ 94%] Linking CXX shared library
[100%] Built target qtutilities
==> Starting check()...
/home/me/.cache/yay/qtutilities/PKGBUILD: line 31: cd: /home/sezovr/.cache/yay/qtutilities/src/qtutilities: No such file or directory
==> ERROR: A failure occurred in check().
Error making: qtutilities

gwpl commented on 2020-04-15 12:24

syncthingtray_0.10.8 compilation error .

full log attached here : .

$ pacaur -S syncthingtray
2: !!!FAILURES!!!
2: Test Results:
2: Run:  1   Failures: 1   Errors: 0
2: 1) test: ApplicationTests::test (F) line: 146 /home/gw/.cache/pacaur/syncthingtray/src/syncthingtray-0.10.8/cli/tests/application.cpp
2: forced failure
2: - Line    Status                        (idle|scanning) could not be found in output.
2: Tests failed
2/2 Test #2: syncthingctl_run_tests ...........***Failed    2.53 sec

0% tests passed, 2 tests failed out of 2

Total Test time (real) =   6.10 sec

The following tests FAILED:
          1 - syncthingconnector_run_tests (Failed)
          2 - syncthingctl_run_tests (Failed)
Errors while running CTest
make[3]: *** [connector/CMakeFiles/check.dir/build.make:77: connector/CMakeFiles/check] Error 8
make[2]: *** [CMakeFiles/Makefile2:632: connector/CMakeFiles/check.dir/all] Error 2
make[1]: *** [CMakeFiles/Makefile2:639: connector/CMakeFiles/check.dir/rule] Error 2
make: *** [Makefile:325: check] Error 2
==> ERROR: A failure occurred in check().
:: failed to build syncthingtray package(s)

tydynrain commented on 2020-03-28 23:20

@Martchus, uninstalling ffmpeg-full and reinstalling ffmpeg, along with using --nocheck worked finally. Thank you.

Martchus commented on 2020-03-28 22:54

I also deleted my comment because it is not very useful without the errors.

So here again: I doubt this has anything to do with this package beside the fact that it is using qt5-webengine which pulls the ffmpeg package which pulls dav1d. It looks like your ffmpeg and dav1d versions aren't matching. Are you using a custom ffmpeg build and missed ?

tydynrain commented on 2020-03-28 22:51

@Marchus The post on the tageditor was an accident, which is why I deleted it. I think I followed a link from this page, which is why I accidentally posted it there.

Martchus commented on 2020-03-28 22:33

Looks like the exact same error as you've got with tageditor. See my comment there. It has likely nothing to do with any of these packages.

tydynrain commented on 2020-03-28 22:30

I got this error during the build phase today:

/usr/bin/ld: warning:, needed by /usr/lib/, not found (try using -rpath or -rpath-link)

/usr/bin/ld: /usr/lib/ undefined reference to `dav1d_get_picture'

/usr/bin/ld: /usr/lib/ undefined reference to `dav1d_version'

/usr/bin/ld: /usr/lib/ undefined reference to `dav1d_data_unref'

/usr/bin/ld: /usr/lib/ undefined reference to `dav1d_open'

/usr/bin/ld: /usr/lib/ undefined reference to `dav1d_data_wrap'

/usr/bin/ld: /usr/lib/ undefined reference to `dav1d_send_data'

/usr/bin/ld: /usr/lib/ undefined reference to `dav1d_flush'

/usr/bin/ld: /usr/lib/ undefined reference to `dav1d_picture_unref'

/usr/bin/ld: /usr/lib/ undefined reference to `dav1d_close'

/usr/bin/ld: /usr/lib/ undefined reference to `dav1d_default_settings'

collect2: error: ld returned 1 exit status

make[2]: *** [tray/CMakeFiles/syncthingtray.dir/build.make:428: tray/syncthingtray] Error 1

make[2]: Leaving directory '/home/tydynrain/.cache/aurutils/sync/syncthingtray/src/syncthingtray-0.10.7'

make[1]: *** [CMakeFiles/Makefile2:1549: tray/CMakeFiles/syncthingtray.dir/all]

Error 2

make[1]: Leaving directory '/home/tydynrain/.cache/aurutils/sync/syncthingtray/src/syncthingtray-0.10.7'

make: *** [Makefile:158: all] Error 2

==> ERROR: A failure occurred in build().


Martchus commented on 2020-02-05 11:25


vanjiii commented on 2020-02-05 11:07

Hey, validity check fails during update:

==> Validating source files with sha256sums...
    syncthingtray-0.10.6.tar.gz ... FAILED
==> ERROR: One or more files did not pass the validity check!
Error downloading sources: syncthingtray