Package Details: supertuxkart-git 20687+17942-1

Git Clone URL: https://aur.archlinux.org/supertuxkart-git.git (read-only, click to copy)
Package Base: supertuxkart-git
Description: A kart racing game featuring Tux and his friends - development version
Upstream URL: http://supertuxkart.sourceforge.net/
Keywords: game
Licenses: cc-by-sa-3.0
Conflicts: supertuxkart
Replaces: supertuxkart-cmakesvn, supertuxkart-svn
Submitter: donny
Maintainer: donny
Last Packager: donny
Votes: 18
Popularity: 0.000800
First Submitted: 2014-01-20 07:32
Last Updated: 2019-01-12 21:13

Latest Comments

« First ‹ Previous 1 2 3 4 5 6 7 Next › Last »

Ewald commented on 2014-01-09 21:28

There appears to be a missing depency to bluez-libs.

FWIW, It got this build error:

Linking CXX static library libbulletdynamics.a
[ 55%] Built target bulletdynamics
Scanning dependencies of target wiiuse
[ 55%] Building C object lib/wiiuse/CMakeFiles/wiiuse.dir/classic.c.o
In file included from /data/pkgbuilds/supertuxkart-svn/src/supertuxkart/lib/wiiuse/classic.h:37:0,
from /data/pkgbuilds/supertuxkart-svn/src/supertuxkart/lib/wiiuse/classic.c:34:
/data/pkgbuilds/supertuxkart-svn/src/supertuxkart/lib/wiiuse/wiiuse_internal.h:73:34: fatal error: bluetooth/bluetooth.h: No such file or directory
#include <bluetooth/bluetooth.h>
^

donny commented on 2013-10-13 11:01

PKGBUILD updated, but not tested with AMD proprietary driver. Hope it will work :) Thanks for your notice.

donny commented on 2013-10-10 07:36

Hi nixscripter, thanks for your message, sorry I'am replying late. I'll update the PKGBUILD tonight as I test it.

nixscripter commented on 2013-09-29 16:37

Oh, also, would you please change the "freeglut" dependency to "glut"? There are some people -- I'm looking at you AMD -- who ship their own glut libraries with their proprietary 3-D stacks.

nixscripter commented on 2013-09-29 01:35

In order to get this to check out properly, I had to change the source URI from the prefix svn+http to svn+https. Other than that, it built okay.

donny commented on 2013-06-24 17:17

Updated SVN repository, see http://forum.freegamedev.net/viewtopic.php?f=17&t=4578

nixscripter commented on 2013-04-23 04:35

It seems to build okay (with a patch similar to mine mentioned late last year), but the install phase dies with this:

make[3]: Entering directory `/home/arch/Software/supertuxkart-svn/src/supertuxkart-build/data/karts'
make[3]: Nothing to be done for `install-exec-am'.
/usr/bin/mkdir -p '/home/arch/Software/supertuxkart-svn/src/supertuxkart-build/../../pkg/usr/share/supertuxkart/data/karts'
/usr/bin/install -c -m 644 ./. ./. ./. ./. ./. ./. ./. ./. '/home/arch/Software/supertuxkart-svn/src/supertuxkart-build/../../pkg/usr/share/supertuxkart/data/karts/.'
/usr/bin/install: omitting directory ‘./.’
/usr/bin/install: omitting directory ‘./.’
/usr/bin/install: omitting directory ‘./.’
/usr/bin/install: omitting directory ‘./.’
/usr/bin/install: omitting directory ‘./.’
/usr/bin/install: omitting directory ‘./.’
/usr/bin/install: omitting directory ‘./.’
/usr/bin/install: omitting directory ‘./.’
make[3]: *** [install-nobase_dist_pkgdataDATA] Error 1
make[3]: Leaving directory `/home/arch/Software/supertuxkart-svn/src/supertuxkart-build/data/karts'
make[2]: *** [install-am] Error 2
make[2]: Leaving directory `/home/arch/Software/supertuxkart-svn/src/supertuxkart-build/data/karts'
make[1]: *** [install-recursive] Error 1
make[1]: Leaving directory `/home/arch/Software/supertuxkart-svn/src/supertuxkart-build/data'
make: *** [install-recursive] Error 1

I don't suppose anyone would know why this happens?

EDIT: I first tried a newer SVN revision than the package, but it does the same thing with the revision in the PKGBUILD.

EDIT 2: It seems that there is a process in the PKGBUILD to work around this, but it dies first. The variable not being set up correctly in the Makefile seems to be based on a shell command stored in $(am__nobase_list).

nixscripter commented on 2013-04-23 04:30

It seems to build okay (with a patch similar to mine mentioned late last year), but the install phase dies with this:

make[3]: Entering directory `/home/arch/Software/supertuxkart-svn/src/supertuxkart-build/data/karts'
make[3]: Nothing to be done for `install-exec-am'.
/usr/bin/mkdir -p '/home/arch/Software/supertuxkart-svn/src/supertuxkart-build/../../pkg/usr/share/supertuxkart/data/karts'
/usr/bin/install -c -m 644 ./. ./. ./. ./. ./. ./. ./. ./. '/home/arch/Software/supertuxkart-svn/src/supertuxkart-build/../../pkg/usr/share/supertuxkart/data/karts/.'
/usr/bin/install: omitting directory ‘./.’
/usr/bin/install: omitting directory ‘./.’
/usr/bin/install: omitting directory ‘./.’
/usr/bin/install: omitting directory ‘./.’
/usr/bin/install: omitting directory ‘./.’
/usr/bin/install: omitting directory ‘./.’
/usr/bin/install: omitting directory ‘./.’
/usr/bin/install: omitting directory ‘./.’
make[3]: *** [install-nobase_dist_pkgdataDATA] Error 1
make[3]: Leaving directory `/home/arch/Software/supertuxkart-svn/src/supertuxkart-build/data/karts'
make[2]: *** [install-am] Error 2
make[2]: Leaving directory `/home/arch/Software/supertuxkart-svn/src/supertuxkart-build/data/karts'
make[1]: *** [install-recursive] Error 1
make[1]: Leaving directory `/home/arch/Software/supertuxkart-svn/src/supertuxkart-build/data'
make: *** [install-recursive] Error 1

I don't suppose anyone would know why this happens?

EDIT: I first tried a newer SVN revision than the package, but it does the same thing with the revision in the PKGBUILD.

nixscripter commented on 2013-04-23 04:29

It seems to build okay (with a patch similar to mine mentioned late last year), but the install phase dies with this:

make[3]: Entering directory `/home/arch/Software/supertuxkart-svn/src/supertuxkart-build/data/karts'
make[3]: Nothing to be done for `install-exec-am'.
/usr/bin/mkdir -p '/home/arch/Software/supertuxkart-svn/src/supertuxkart-build/../../pkg/usr/share/supertuxkart/data/karts'
/usr/bin/install -c -m 644 ./. ./. ./. ./. ./. ./. ./. ./. '/home/arch/Software/supertuxkart-svn/src/supertuxkart-build/../../pkg/usr/share/supertuxkart/data/karts/.'
/usr/bin/install: omitting directory ‘./.’
/usr/bin/install: omitting directory ‘./.’
/usr/bin/install: omitting directory ‘./.’
/usr/bin/install: omitting directory ‘./.’
/usr/bin/install: omitting directory ‘./.’
/usr/bin/install: omitting directory ‘./.’
/usr/bin/install: omitting directory ‘./.’
/usr/bin/install: omitting directory ‘./.’
make[3]: *** [install-nobase_dist_pkgdataDATA] Error 1
make[3]: Leaving directory `/home/arch/Software/supertuxkart-svn/src/supertuxkart-build/data/karts'
make[2]: *** [install-am] Error 2
make[2]: Leaving directory `/home/arch/Software/supertuxkart-svn/src/supertuxkart-build/data/karts'
make[1]: *** [install-recursive] Error 1
make[1]: Leaving directory `/home/arch/Software/supertuxkart-svn/src/supertuxkart-build/data'
make: *** [install-recursive] Error 1

It's probably an upstream problem (since I went past the SVN revision on the package), but I don't suppose anyone would know why this happens?

EDIT: I had a never SVN revision than the package, but it does the same thing with the revision in the PKGBUILD.

nixscripter commented on 2013-04-19 06:13

When I update the SVN repo to r12673, it seems to build okay (with a patch similar to mine mentioned late last year), but the install phase dies with this:

make[3]: Entering directory `/home/arch/Software/supertuxkart-svn/src/supertuxkart-build/data/karts'
make[3]: Nothing to be done for `install-exec-am'.
/usr/bin/mkdir -p '/home/arch/Software/supertuxkart-svn/src/supertuxkart-build/../../pkg/usr/share/supertuxkart/data/karts'
/usr/bin/install -c -m 644 ./. ./. ./. ./. ./. ./. ./. ./. '/home/arch/Software/supertuxkart-svn/src/supertuxkart-build/../../pkg/usr/share/supertuxkart/data/karts/.'
/usr/bin/install: omitting directory ‘./.’
/usr/bin/install: omitting directory ‘./.’
/usr/bin/install: omitting directory ‘./.’
/usr/bin/install: omitting directory ‘./.’
/usr/bin/install: omitting directory ‘./.’
/usr/bin/install: omitting directory ‘./.’
/usr/bin/install: omitting directory ‘./.’
/usr/bin/install: omitting directory ‘./.’
make[3]: *** [install-nobase_dist_pkgdataDATA] Error 1
make[3]: Leaving directory `/home/arch/Software/supertuxkart-svn/src/supertuxkart-build/data/karts'
make[2]: *** [install-am] Error 2
make[2]: Leaving directory `/home/arch/Software/supertuxkart-svn/src/supertuxkart-build/data/karts'
make[1]: *** [install-recursive] Error 1
make[1]: Leaving directory `/home/arch/Software/supertuxkart-svn/src/supertuxkart-build/data'
make: *** [install-recursive] Error 1

It's probably an upstream problem (since I went past the SVN revision on the package), but I don't suppose anyone would know why this happens?