Package Details: stress-ng 0.12.08-1

Git Clone URL: (read-only, click to copy)
Package Base: stress-ng
Description: stress-ng will stress test a computer system in various selectable ways
Upstream URL:
Licenses: GPL
Submitter: sergej
Maintainer: thomaswucher
Last Packager: thomaswucher
Votes: 23
Popularity: 1.05
First Submitted: 2014-08-12 10:21
Last Updated: 2021-05-12 14:32

Latest Comments

1 2 Next › Last »

vith commented on 2021-04-01 14:02

Missing makedep: aur/intel-ipsec-mb

~> stress-ng --ipsec-mb 6
stress-ng: info:  [49811] ipsec_mb: stressor will be skipped, CPU needs to be an x86-64 and a recent IPSec MB library is required.
stress-ng: info:  [49811] defaulting to a 86400 second (1 day, 0.00 secs) run per stressor
stress-ng: error: [49811] No stress workers invoked (one or more were unsupported)

Installing intel-ipsec-mb and doing a clean rebuild of stress-ng fixed this for me.

EarthMind commented on 2019-03-23 08:37


thomaswucher commented on 2018-08-18 08:30

Thanks for reporting @asbachb. Should be working again with the lastest version of stress-ng!

asbachb commented on 2018-08-09 09:46

I'm not able to build this package:

In file included from stress-access.c:25:
stress-ng.h:2925:8: error: redefinition of ‘struct statx_timestamp’
 struct statx_timestamp {
In file included from /usr/include/sys/stat.h:446,
                 from /usr/include/bsd/stdlib.h:50,
                 from stress-ng.h:85,
                 from stress-access.c:25:
/usr/include/bits/statx.h:25:8: note: originally defined here
 struct statx_timestamp
make[1]: *** [Makefile:323: stress-access.o] Error 1
make[1]: Leaving directory '/home/asbachb/.cache/pacaur/stress-ng/src/stress-ng-0.09.31'
make: *** [Makefile:310: all_config] Error 2
==> ERROR: A failure occurred in build().
:: failed to build stress-ng package(s)

grisu48 commented on 2017-04-05 11:33

Thanks @thomaswucher, I redownloaded it and now it builds!

thomaswucher commented on 2017-04-04 19:34

@grisu48 thanks for the comment, should be fixed now.

grisu48 commented on 2017-04-04 19:15

Hello Guys,

under Linux 4.9.20-1-lts the current package won't build. gcc Version 6.3.1 20170306 on a Intel i7-7500U

stress-fp-error.c: In function ‘stress_fp_error’:
stress-fp-error.c:91:4: error: ‘EDOM’ undeclared (first use in this function)
stress-fp-error.c:91:4: note: each undeclared identifier is reported only once for each function it appears in
stress-fp-error.c:95:4: error: ‘ERANGE’ undeclared (first use in this function)
make: *** [Makefile:397: stress-fp-error.o] Error 1
==> ERROR: A failure occurred in build().


thomaswucher commented on 2016-03-21 18:49

@uberGeek done

uberGeek commented on 2016-03-20 20:42

When you have time, please add 'aarch64' to arch().

Thank you!

Hellrespawn commented on 2015-12-15 15:36

Source file doesn't exist (it's packaged as .tar.gz), and the md5sum does not match the .tar.gz file. Also, 0.05.04 has been released.