Package Details: spacefm 1.0.6-3

Git Clone URL: (read-only, click to copy)
Package Base: spacefm
Description: Multi-panel tabbed file manager
Upstream URL:
Keywords: file gtk3 manager
Licenses: GPL3
Submitter: arojas
Maintainer: FabioLolix
Last Packager: FabioLolix
Votes: 50
Popularity: 0.55
First Submitted: 2017-02-16 16:26
Last Updated: 2020-07-04 12:36

Dependencies (17)

Sources (3)

Latest Comments

1 2 Next › Last »

macxcool commented on 2020-06-29 20:49

@FabioLolix That seems to have done it. Thanks.

FabioLolix commented on 2020-06-29 20:45

fixed, had a leftover in my common srcdest

macxcool commented on 2020-06-29 19:46

spacefm-glibc-2.28-compatibility.patch ... FAILED

wrong sha256 sum

macxcool commented on 2020-06-24 00:46

I can confirm that a fresh clone of the github master branch with the glibc patch does not build anymore.

According to another patch is needed to make things work.

I can confirm that adding the patch in the link above does fix the problem. Everything works once that is applied.

macxcool commented on 2020-06-24 00:38

@Christophero This isn't what 'out of date' is for. If anything this is a bug upstream. Leave a bug report on the spacefm github if there's a problem compiling.

Cristophero commented on 2020-06-08 11:15

collect2: error: ld returned 1 exit status make[1]: [Makefile:857: spacefm] Error 1 make[1]: se sale del directorio '/home/cristo/spacefm/src/spacefm-1.0.6/src' make: [Makefile:507: all-recursive] Error 1 ==> ERROR: Se produjo un fallo en build().

fdservices commented on 2018-08-17 13:43

There is a bug report and solution at

Add #include <sys sysmacros.h=""> to /sys/main.c</sys>

fdservices commented on 2018-08-17 10:13

The errors seem to be:

main.c: In function ‘get_inode_tag’: main.c:189:42: error: implicit declaration of function ‘major’ [-Werror=implicit-function-declaration] major( stat_buf.st_dev ), ^~~~~ main.c:190:42: error: implicit declaration of function ‘minor’; did you mean ‘mknod’? [-Werror=implicit-function-declaration] minor( stat_buf.st_dev ), ^~~~~ mknod

laslozp commented on 2018-08-14 18:09

Cannot compile

cc1: some warnings being treated as errors make[1]: [Makefile:1741: spacefm-main.o] Error 1 make[1]: Leaving directory '/tmp/yaourt-tmp-laslo/aur-spacefm/src/spacefm-1.0.6/src' make: [Makefile:507: all-recursive] Error 1 ==> ERROR: A failure occurred in build(). Aborting... ==> ERROR: Makepkg was unable to build spacefm.

stylemistake commented on 2018-05-28 14:45

Yes, apparently there's no maintainer.