Package Details: solarus 1.6.2-1

Git Clone URL: (read-only, click to copy)
Package Base: solarus
Description: A lightweight, free and open-source game engine for Action-RPGs
Upstream URL:
Licenses: GPL
Conflicts: solarus-git, zsdxdemo-de, zsdxdemo-en, zsdxdemo-fr
Provides: solarus-engine
Replaces: solarus-git, zsdxdemo-de, zsdxdemo-en, zsdxdemo-fr
Submitter: BenObiWan
Maintainer: MCMic
Last Packager: MCMic
Votes: 39
Popularity: 0.62
First Submitted: 2011-12-17 11:58
Last Updated: 2020-04-05 15:17

Latest Comments

1 2 Next › Last »

ShalokShalom commented on 2017-01-11 20:35

There is no desktop starter for the new launcher GUI

skull-y commented on 2016-08-20 22:08

Thanks, now it works.

BenObiWan commented on 2016-08-18 20:47

Please try again.

skull-y commented on 2016-08-18 13:29

Here the error from terminal:

And here the error from cmake logfile:

I've read the error from my terminal again, should I install Qt5?

BenObiWan commented on 2016-08-17 19:48


well the exact error message would be a start, can't do anything with what you've provided.
Please follow this:


skull-y commented on 2016-08-17 14:49

I can't compile it. I've got an error about cmake. Tell me if u need something from the logfile.

carstene1ns commented on 2013-12-05 19:47

FYI: 1.1.1 is out. also, you can remove the not used variables from your PKGBUILD.

BenObiWan commented on 2012-12-26 21:58

cmake uses lua5.1 library, but lua5.2 headers...
Works better after specifying LUA_INCLUDE_DIR.

gh0st commented on 2012-12-24 19:54

/tmp/yaourt-tmp-kasper/aur-solarus/src/solarus-0.9.2/src/DialogResource.cpp: In static member function ‘static void DialogResource::initialize()’:
/tmp/yaourt-tmp-kasper/aur-solarus/src/solarus-0.9.2/src/DialogResource.cpp:51:27: error: ‘lua_open’ was not declared in this scope
make[2]: *** [src/CMakeFiles/solarus_static.dir/DialogResource.cpp.o] Error 1
make[1]: *** [src/CMakeFiles/solarus_static.dir/all] Error 2
make: *** [all] Error 2

son_link commented on 2012-06-04 21:11

lua 5.1.5-2
sdl_image 1.2.12-2
sdl_ttf 2.0.11-2
physfs 2.0.2-2
openal 1.14-1
libvorbis 1.3.3-1
cmake 2.8.8-2
zip 3.0-3
error: el paquete 'gcc-multilib' no fue encontrado
error: el paquete 'gcc-libs-multilib' no fue encontrado
gcc 4.7.0-6
gcc-libs 4.7.0-6

My system is 32 bits