Package Details: siril 0.9.11-1

Git Clone URL: (read-only)
Package Base: siril
Description: An astronomical image processing software for Linux. (IRIS clone)
Upstream URL:
Licenses: GPLv3
Submitter: vinvin
Maintainer: vinvin
Last Packager: vinvin
Votes: 8
Popularity: 0.000174
First Submitted: 2012-10-15 00:40
Last Updated: 2019-05-28 00:24

Dependencies (14)

Required by (0)

Sources (1)

Latest Comments

« First ‹ Previous 1 2 3 Next › Last »

vinvin commented on 2016-08-18 08:57

That's strange, it looks like intltool is missing although I added it in the makedepends list. Have you installed it? Maybe something else is needed.

t-1 commented on 2016-08-18 07:10

BUILD ERROR in version 0.9.4-1

./configure: line 2756: syntax error near unexpected token `0.50'
./configure: line 2756: `IT_PROG_INTLTOOL(0.50)'
+ exit 1

please help

vinvin commented on 2016-04-22 22:32

I have updated the package to have it install icons and file associations (.desktop and mime .xml files).

vinvin commented on 2016-04-12 21:12

The problem has been solved, with another critical issue in preprocessing. 0.9.3 has been reissued and I updated the package to the final version. We'll resume the release candidate cycle next time to avoid this... It's been a while without release. Sorry, please update.

craftyguy commented on 2016-04-11 00:36

latest version still fails to build...

gui/callbacks.c: In function ‘set_filters_dialog’:
gui/callbacks.c:1711:8: error: ‘i’ undeclared (first use in this function)
for (i = 0; i < nb_film; i++) {
gui/callbacks.c:1711:8: note: each undeclared identifier is reported only once for each function it appears in
Makefile:666: recipe for target 'gui/callbacks.o' failed
make[2]: *** [gui/callbacks.o] Error 1

vinvin commented on 2016-04-10 19:10

0.9.2 has been reissued to fix the ffms2 issue reported by ansatz, and I was hoping I could update the AUR package soon enough. But another issue was found and now we are releasing 0.9.3. Anyway, I updated the package to bump to 0.9.3 as well. Sorry for the inconvenience.

pumpkin commented on 2016-04-10 15:07

==> Validating source files with sha1sums...
siril-0.9.2.tar.bz2 ... FAILED
==> ERROR: One or more files did not pass the validity check!

The sha1sum of is:

Is the PKGBUILD wrong ? Or the package has changed ?

ansatz commented on 2016-04-06 07:13

Won't build without ffms2:

checking for FFMS2... no
checking for FFMS2... no
configure: error: Package requirements (ffms2 >= 2.21) were not met:

No package 'ffms2' found

Consider adjusting the PKG_CONFIG_PATH environment variable if you
installed software in a non-standard prefix.

Alternatively, you may set the environment variables FFMS2_CFLAGS
and FFMS2_LIBS to avoid the need to call pkg-config.
See the pkg-config man page for more details.
==> ERROR: A failure occurred in build().

vinvin commented on 2016-04-05 21:15

Version 0.9.2 has been released.
See for more information.

craftyguy commented on 2015-12-17 21:03

Build fails with the following:

gui/callbacks.c: In function ‘set_filters_dialog’:
gui/callbacks.c:1703:8: error: ‘i’ undeclared (first use in this function)
for (i = 0; i < nb_film; i++) {
gui/callbacks.c:1703:8: note: each undeclared identifier is reported only once for each function it appears in
Makefile:632: recipe for target 'gui/callbacks.o' failed