Package Details: sdlmame-wout-toolkits 0.218-1

Git Clone URL: (read-only, click to copy)
Package Base: sdlmame-wout-toolkits
Description: A port of the popular Multiple Arcade Machine Emulator using SDL with OpenGL support. Without Qt toolkit
Upstream URL:
Licenses: custom:MAME License
Conflicts: mame, sdlmame, sdlmamefamily-tools
Submitter: sl1pkn07
Maintainer: sl1pkn07
Last Packager: sl1pkn07
Votes: 2
Popularity: 0.000000
First Submitted: 2013-03-21 19:35
Last Updated: 2020-02-26 02:28

Latest Comments

1 2 Next › Last »

Ambrevar commented on 2018-01-11 09:17

The checksum array seems to be out-of-date:

==> Validating source files with sha256sums... mame0188.tar.gz ... FAILED

agapito commented on 2015-12-12 03:41

Can't compile...

Generating ../tmp/yaourt-tmp/aur-sdlmame-wout-toolkits/projects/sdl/mame/gmake-linux/castool.make...
Generating ../tmp/yaourt-tmp/aur-sdlmame-wout-toolkits/projects/sdl/mame/gmake-linux/floptool.make...
Generating ../tmp/yaourt-tmp/aur-sdlmame-wout-toolkits/projects/sdl/mame/gmake-linux/imgtool.make...
make -R verbose=1 -C /tmp/yaourt-tmp/aur-sdlmame-wout-toolkits/projects/sdl/mame/gmake-linux config=release64
make[1]: *** /tmp/yaourt-tmp/aur-sdlmame-wout-toolkits/projects/sdl/mame/gmake-linux: No existe el fichero o el directorio. Alto.
makefile:996: fallo en las instrucciones para el objetivo 'linux_x64'
make: *** [linux_x64] Error 2

Anonymous comment on 2013-02-01 07:23

Beware, with this option enabled I got compile error in the middle of build process (redbaron.o) on my platform - Arch X_64, CPU AMD E350, gcc 4.7.2-4

sl1pkn07 commented on 2013-01-16 13:22

TIP: edit your /etc/makepkg.conf and uncomment MAKEFLAGS= line, and edit according you num of cores. example 2 cores = "-j2", 4 cores = "-j4". etc

sl1pkn07 commented on 2013-01-16 13:13

oh! i see


OrdinaryMagician commented on 2013-01-16 12:30

in build() just right after applying the patch to disable gconf and gtk dependencies.

sl1pkn07 commented on 2013-01-14 00:15

build fine for me

sl1pkn07 commented on 2013-01-13 23:52

in what part? in build? in package... more info

OrdinaryMagician commented on 2013-01-13 23:50

Doesn't build, error:

make: *** empty string invalid as file name. Stop.

Anonymous comment on 2012-07-05 16:35

I receiving this error:

{standard input}: Assembler messages:
{standard input}:3062: Warning: end of file not at end of a line; newline inserted
{standard input}:3204: Error: unbalanced parenthesis in operand 1.
{standard input}: Error: open CFI at the end of file; missing .cfi_endproc directive
gcc: internal compiler error: Killed (program cc1plus)
Please submit a full bug report,
with preprocessed source if appropriate.
See <> for instructions.
make: *** [obj/sdl/emu/cpu/tms57002/tms57002.o] Error 4
==> ERROR: A failure occurred in build().