Package Details: sdfat-dkms 2.1.10.6-2

Git Clone URL: https://aur.archlinux.org/sdfat-dkms.git (read-only, click to copy)
Package Base: sdfat-dkms
Description: FAT12/16/32(VFAT)/exFAT filesystem kernel module - use with DKMS
Upstream URL: https://github.com/tbk/kernel-sdfat
Keywords: dkms exfat fat sdfat vfat
Licenses: GPL-2.0-only
Conflicts: exfat, exfat-dkms-git, sdfat-dkms-git, vfat
Submitter: tbk
Maintainer: tbk
Last Packager: tbk
Votes: 3
Popularity: 0.000031
First Submitted: 2019-03-28 05:32
Last Updated: 2019-07-17 20:00

Pinned Comments

tbk commented on 2019-04-29 22:50

Ensure that exfat-utils is not installed or this pkg will fail to install because the mount.exfat files will clash.

I can not add exfat-utils as a conflict since that will make it impossible to install exfat-utils-nofuse (provides exfat-utils).

Latest Comments

LoganDark commented on 2020-08-28 23:24

Install fails for me...

  CC [M]  /var/lib/dkms/sdfat/2.1.10.6/build/extent.o
/var/lib/dkms/sdfat/2.1.10.6/build/misc.c:172:8: error: unknown type name ‘time_t’
  172 | static time_t accum_days_in_year[] = {
      |        ^~~~~~
/var/lib/dkms/sdfat/2.1.10.6/build/misc.c: In function ‘sdfat_time_fat2unix’:
/var/lib/dkms/sdfat/2.1.10.6/build/misc.c:181:2: error: unknown type name ‘time_t’; did you mean ‘ktime_t’?
  181 |  time_t year = tp->Year;
      |  ^~~~~~
      |  ktime_t
/var/lib/dkms/sdfat/2.1.10.6/build/misc.c:182:2: error: unknown type name ‘time_t’; did you mean ‘ktime_t’?
  182 |  time_t ld; /* leap day */
      |  ^~~~~~
      |  ktime_t
/var/lib/dkms/sdfat/2.1.10.6/build/misc.c: In function ‘sdfat_time_unix2fat’:
/var/lib/dkms/sdfat/2.1.10.6/build/misc.c:204:2: error: unknown type name ‘time_t’; did you mean ‘ktime_t’?
  204 |  time_t second = ts->tv_sec;
      |  ^~~~~~
      |  ktime_t
/var/lib/dkms/sdfat/2.1.10.6/build/misc.c:205:2: error: unknown type name ‘time_t’; did you mean ‘ktime_t’?
  205 |  time_t day, month, year;
      |  ^~~~~~
      |  ktime_t
/var/lib/dkms/sdfat/2.1.10.6/build/misc.c:206:2: error: unknown type name ‘time_t’; did you mean ‘ktime_t’?
  206 |  time_t ld; /* leap day */
      |  ^~~~~~
      |  ktime_t
make[1]: *** [scripts/Makefile.build:280: /var/lib/dkms/sdfat/2.1.10.6/build/misc.o] Error 1
make[1]: *** Waiting for unfinished jobs....
cc1: some warnings being treated as errors
make[1]: *** [scripts/Makefile.build:280: /var/lib/dkms/sdfat/2.1.10.6/build/sdfat.o] Error 1
make: *** [Makefile:1756: /var/lib/dkms/sdfat/2.1.10.6/build] Error 2
make: Leaving directory '/usr/lib/modules/5.8.5-arch1-1/build'

Galaxy commented on 2019-07-17 09:02

Is there an example for /etc/fstab ? I get "wrong fs type, bad option, bad superblock on /dev/sda6, missing codepage or helper program, or other error" even with the /etc/mtab line.

tbk commented on 2019-04-29 22:50

Ensure that exfat-utils is not installed or this pkg will fail to install because the mount.exfat files will clash.

I can not add exfat-utils as a conflict since that will make it impossible to install exfat-utils-nofuse (provides exfat-utils).