Package Details: sam2p 0.49.4-7

Git Clone URL: https://aur.archlinux.org/sam2p.git (read-only, click to copy)
Package Base: sam2p
Description: A bitmap-to-eps-or-pdf-converter that produces very small files
Upstream URL: http://www.inf.bme.hu/~pts
Keywords: imake
Licenses: GPL2
Submitter: haawda
Maintainer: haawda (zoe)
Last Packager: haawda
Votes: 24
Popularity: 0.000000
First Submitted: 2007-09-28 18:11
Last Updated: 2018-11-18 02:54

Dependencies (6)

Required by (1)

Sources (1)

Latest Comments

« First ‹ Previous 1 2 3 4

haawda commented on 2011-09-15 19:27

Just tested: rebuilding gcc34 fixes the issue here.

haawda commented on 2011-09-15 19:11

Try to rebuild gcc34. This sounds like a broken gcc34 installation.

florianbw commented on 2011-09-15 14:58

Does not build with x86_64: checking for C++ compiler default output... configure: error: C++ compiler cannot create executables

Anonymous comment on 2011-05-09 17:33

Doesn't build properly with newer releases.

To fix, add these two lines before the ./configure in the PKGBUILD:

touch stdafx.h
perl -x hq.pl <bts.ttt >bts2.tth

Hope this helps, as it was the only fix I could find.

Nicky726 commented on 2010-05-18 14:53

Thanx.

haawda commented on 2010-05-18 11:41

Works with gcc34.

haawda commented on 2010-05-18 11:11

confirmed, also for i686.

Nicky726 commented on 2010-05-18 08:55

Does not build for me at x86_64:

configure: WARNING: cannot find inttype: sizeof(inttype)==16
checking size of char *... (cached) 8
checking size of void *... 8
checking for an integral type to hold a ptr... long
checking for ptr <-> integral conversion... yes
checking for integral type size_t... unsigned long
checking size of bool... 1
configure: creating ./config.status
config.status: creating Makehelp
config.status: creating config.h
running make Makedep... error
configure: error: cannot compute depends
Makefile:43: Makedep: Adresář nebo soubor neexistuje
perl -x -S ./ccdep.pl --FAL=assert,no,yes,checker g++
./ccdep.pl: running.
+ g++ -DOBJDEP -M -MG -E 2>&1 testfax_main.c in_jpeg.cpp pts_fax.c error.cpp rule.cpp in_pnm.cpp ps_tiny.c encoder.cpp in_tga.cpp in_png.cpp test_main.cpp in_tiff.cpp cgif.c c_lgcc.cpp sam2p_main.cpp vcsam2p.cpp snprintf.c appliers.cpp gensi.cpp mapping.cpp minips.cpp pts_defl.c in_lbm.cpp crc32.c StdAfx.cpp gensio.cpp in_gif.cpp in_pcx.cpp in_jai.cpp c_lgcc3.cpp pts_lzw.c in_ps.cpp in_bmp.cpp in_xpm.cpp image.cpp jpegdump_main.cpp out_gif.cpp
+ g++ -DOBJDEP -E 2>&1 >/dev/null testfax_main.c in_jpeg.cpp pts_fax.c error.cpp rule.cpp in_pnm.cpp ps_tiny.c encoder.cpp in_tga.cpp in_png.cpp test_main.cpp in_tiff.cpp cgif.c c_lgcc.cpp sam2p_main.cpp vcsam2p.cpp snprintf.c appliers.cpp gensi.cpp mapping.cpp minips.cpp pts_defl.c in_lbm.cpp crc32.c StdAfx.cpp gensio.cpp in_gif.cpp in_pcx.cpp in_jai.cpp c_lgcc3.cpp pts_lzw.c in_ps.cpp in_bmp.cpp in_xpm.cpp image.cpp jpegdump_main.cpp out_gif.cpp
./ccdep.pl: invalid depret: [sam2p_main.cpp:147:20: fatal error: bts2.tth: Adresář nebo soubor neexistuje]
make: *** [Makedep] Error 1
==> CHYBA: Sestavení selhalo.
Probíhá rušení...
Error: Makepkg was unable to build sam2p package.

GCC4.5?