Package Details: salome-smesh 7.8.0-1

Git Clone URL: (read-only, click to copy)
Package Base: salome-smesh
Description: Generic platform for Pre and Post-Processing for numerical simulation - SMESH Module
Upstream URL:
Licenses: LGPL
Submitter: mickele
Maintainer: gbs
Last Packager: mickele
Votes: 7
Popularity: 0.000000
First Submitted: 2010-06-05 18:17
Last Updated: 2016-12-20 06:23

Latest Comments

blixawillbargeld commented on 2017-01-06 12:44

Thanks @Tomatopaste
Now it works!

Tomatopaste commented on 2016-12-21 14:18

Replace the reference by salome-medcoupling, so that the corresponding line in the build() function of the PKGBUILD looks like:
source /opt/salome/env.d/

Alexa commented on 2016-08-09 22:23

Hi Mickele

this package does not build...

Scanning dependencies of target MeshDriverMED
[ 21%] Building CXX object src/DriverMED/CMakeFiles/MeshDriverMED.dir/DriverMED_W_SMESHDS_Mesh.cxx.o
/home/alex/archPkg/pacaurtmp-alex/salome-smesh/salome-smesh/src/smesh/src/DriverMED/DriverMED_W_SMESHDS_Mesh.cxx: In member function ‘virtual Driver_Mesh::Status DriverMED_W_SMESHDS_Mesh::Perform()’:
/home/alex/archPkg/pacaurtmp-alex/salome-smesh/salome-smesh/src/smesh/src/DriverMED/DriverMED_W_SMESHDS_Mesh.cxx:527:81: error: cannot convert ‘MED::PPolygoneInfo {aka MED::SharedPtr<MED::TPolygoneInfo>}’ to ‘bool’ in initialization
bool polyTypesSupported = myMed->CrPolygoneInfo(aMeshInfo,eMAILLE,ePOLYGONE,0,0);
make[2]: *** [src/DriverMED/CMakeFiles/MeshDriverMED.dir/build.make:87: src/DriverMED/CMakeFiles/MeshDriverMED.dir/DriverMED_W_SMESHDS_Mesh.cxx.o] Error 1
make[1]: *** [CMakeFiles/Makefile2:974: src/DriverMED/CMakeFiles/MeshDriverMED.dir/all] Error 2
make: *** [Makefile:139: all] Error 2

mickele commented on 2015-10-05 19:02

Issue was caused by an error in swig-2 detection (old PKGBUILD was using swig, not swig-2).
Last rel (7.6.0-3) should solve your issue.

saxonbeta commented on 2015-10-05 16:03

I can't compile the package, I get the following error:
CMake Error at /opt/salome/kernel/salome_adm/cmake_files/SalomeMacros.cmake:517 (MESSAGE):
Package SWIG couldn't be found - did you set the corresponing root dir
correctly? It currently contains SWIG_ROOT_DIR=/usr Append
-DSALOME_CMAKE_DEBUG=ON on the command line if you want to see the original
CMake error.

Swig2 is already installed!

mickele commented on 2015-09-29 17:14

I am working on salome-paravis!

mickele commented on 2015-09-29 16:55

Done (7.6.0-2)

screwit commented on 2015-09-28 20:15

Sphinx error here too!,no problem salome-med. TIA

mickele commented on 2010-08-01 15:25

Updated to 5.1.4!

mickele commented on 2010-06-27 13:17

5.1.3-2 - this updated contains a lot of bugfix.