Package Details: ros-melodic-std-msgs 0.5.12-1

Git Clone URL: https://aur.archlinux.org/ros-melodic-std-msgs.git (read-only, click to copy)
Package Base: ros-melodic-std-msgs
Description: ROS - Standard ROS Messages including common message types representing primitive data types and other basic message constructs, such as multiarrays.
Upstream URL: https://www.wiki.ros.org/std_msgs
Licenses: BSD
Submitter: GPereira
Maintainer: bionade24
Last Packager: bionade24
Votes: 1
Popularity: 0.000011
First Submitted: 2018-05-08 13:29
Last Updated: 2019-10-07 19:14

Required by (169)

Sources (1)

Latest Comments

bionade24 commented on 2019-06-28 12:48

@ank_s: Try to recompile ros-melodic-camera-calibration-parsers

ank_s commented on 2019-06-28 11:11

Build Failing:

Traceback (most recent call last):
  File "/usr/lib/python3.7/site-packages/catkin_pkg/package.py", line 540, in parse_package_string
    root = dom.parseString(data)
  File "/usr/lib/python3.7/xml/dom/minidom.py", line 1968, in parseString
    return expatbuilder.parseString(string)
  File "/usr/lib/python3.7/xml/dom/expatbuilder.py", line 925, in parseString
    return builder.parseString(string)
  File "/usr/lib/python3.7/xml/dom/expatbuilder.py", line 223, in parseString
    parser.Parse(string, True)
xml.parsers.expat.ExpatError: no element found: line 1, column 0

During handling of the above exception, another exception occurred:

Traceback (most recent call last):
  File "/opt/ros/melodic/lib/python3.7/site-packages/geneus/geneus_main.py", line 137, in genmain
    pkg_map = get_pkg_map()
  File "/opt/ros/melodic/lib/python3.7/site-packages/geneus/geneus_main.py", line 56, in get_pkg_map
    pkgs = packages.find_packages(ws)
  File "/usr/lib/python3.7/site-packages/catkin_pkg/packages.py", line 89, in find_packages
    packages = find_packages_allowing_duplicates(basepath, exclude_paths=exclude_paths, exclude_subspaces=exclude_subspaces, warnings=warnings)
  File "/usr/lib/python3.7/site-packages/catkin_pkg/packages.py", line 150, in find_packages_allowing_duplicates
    xml, filename=filename, warnings=warnings)
  File "/usr/lib/python3.7/site-packages/catkin_pkg/package.py", line 542, in parse_package_string
    raise InvalidPackage('The manifest contains invalid XML:\n%s' % ex, filename)
catkin_pkg.package.InvalidPackage: Error(s) in package '/opt/ros/melodic/share/camera_calibration_parsers/package.xml':

The manifest contains invalid XML:
no element found: line 1, column 0
ERROR:  Error(s) in package '/opt/ros/melodic/share/camera_calibration_parsers/package.xml':
The manifest contains invalid XML:
no element found: line 1, column 0
make[2]: *** [CMakeFiles/std_msgs_generate_messages_eus.dir/build.make:276: devel/share/roseus/ros/std_msgs/manifest.l] Error 3
make[1]: *** [CMakeFiles/Makefile2:1709: CMakeFiles/std_msgs_generate_messages_eus.dir/all] Error 2
make: *** [Makefile:130: all] Error 2