Package Details: ros-melodic-qt-gui-cpp 0.3.14-1

Git Clone URL: https://aur.archlinux.org/ros-melodic-qt-gui-cpp.git (read-only)
Package Base: ros-melodic-qt-gui-cpp
Description: ROS - qt_gui_cpp provides the foundation for C++-bindings for qt_gui and creates bindings for every generator available.
Upstream URL: https://wiki.ros.org/qt_gui_cpp
Licenses: BSD
Submitter: GPereira
Maintainer: bionade24
Last Packager: bionade24
Votes: 2
Popularity: 0.056714
First Submitted: 2018-05-08 14:15
Last Updated: 2019-10-13 09:42

Latest Comments

1 2 3 4 Next › Last »

acxz commented on 2019-10-11 05:35

Hey fellows, the maintainers of ROS Melodic on AUR rarely check the AUR comment sections of the packages. In fact, we use a github mirror, https://github.com/ros-melodic-arch. These comments and concerns would be more visible on the issues page of https://github.com/ros-melodic-arch/ros-melodic-qt-gui-cpp/issues and some may even be addressed.

This boost issue should be fixed when the following PR (https://github.com/ros-melodic-arch/ros-melodic-qt-gui-cpp/pull/10) gets merged and synced with the AUR.

hb21 commented on 2019-10-11 01:47

@Nim65s The -DBoost_NO_BOOST_CMAKE=ON flag worked for me

Nim65s commented on 2019-10-09 15:15

@Thraen: Boost has a new .pc file, which is read by CMake, and changes a few things… Maybe you can try with the -DBoost_NO_BOOST_CMAKE=ON option.

Thraen commented on 2019-10-09 14:25

Another problem happened after the Boost package update : ld can't find -lBoost::system and ld can't find -lBoost::filesystem. It look like c++ namespace, i don't know how they arrived in a makefile. You can solve the problem using a sed command to remove those entries in build/src/qt_gui_cpp_sip/CMakeFiles/libqt_gui_cpp_sip.dir/build.make

stormer commented on 2019-10-08 17:19

@Thraen Thank you that solved it, I am sorry that I was unresponsive start of the semester hit me hard

Thraen commented on 2019-10-08 14:54

@Stormer Just uninstall pyside2 and python-pyside, then install sip and python-sip. Everything should work as expected. Those dependencies should be included in the package btw.

stormer commented on 2019-10-02 08:38

@Thraen Thank you for trying to solve this problem. If you make progress please update me :D

Thraen commented on 2019-10-02 08:04

@stormer, hi, i think the problem here is that shiboken now uses --"generator-set" instead of "--generatorSet". I'm still looking where do to the modifications...

EDIT: ok, just follow this and it'll be good https://github.com/ros-visualization/qt_gui_core/issues/142

stormer commented on 2019-09-30 11:24

Hi a have problem installing this package. I had tried all of the fixes mentioned here but none of them helped.

I would be grateful, if anyone have any tips what to do next

The error message: 48%] Running Shiboken generator for libqt_gui_cpp Python bindings... /bin/sh: --generatorSet=shiboken: command not found make[2]: [src/qt_gui_cpp_shiboken/CMakeFiles/qt_gui_cpp_shiboken.dir/build.make:75: src/qt_gui_cpp_shiboken/libqt_gui_cpp_shiboken/libqt_gui_cpp_shiboken_module_wrapper.cpp] Error 127 make[1]: [CMakeFiles/Makefile2:330: src/qt_gui_cpp_shiboken/CMakeFiles/qt_gui_cpp_shiboken.dir/all] Error 2 make: *** [Makefile:130: all] Error 2 sed: can't read src/build/sip/qt_gui_cpp_sip/Makefile: No such file or directory ==> ERROR: A failure occurred in build(). Aborting...

UtkarshKunwar commented on 2019-09-01 15:38

I am still facing the same issue even after the latest update which includes the fix for the Qt lib errors. QT_INSTALL_LIBS=0

g++: error: 0/libQt5Core.so: No such file or directory
make[3]: *** [Makefile:38: "/home/utkarsh/.cache/pikaur/build/ros-melodic-qt-gui-cpp/src/build/devel/lib/python3.7/site-packages/qt_gui_cpp/libqt_gui_cpp_sip".so] Error 1
make[2]: *** [src/qt_gui_cpp_sip/CMakeFiles/libqt_gui_cpp_sip.dir/build.make:61: devel/lib/python3.7/site-packages/qt_gui_cpp/libqt_gui_cpp_sip.so] Error 2
make[1]: *** [CMakeFiles/Makefile2:349: src/qt_gui_cpp_sip/CMakeFiles/libqt_gui_cpp_sip.dir/all] Error 2
make: *** [Makefile:130: all] Error 2
sed: can't read src/build/sip/qt_gui_cpp_sip/Makefile: No such file or directory
==> ERROR: A failure occurred in build().
    Aborting...

EDIT: Fixed it by changing the line to sed -i 's/$$\[QT_INSTALL_LIBS\]/\/usr\/lib/' ${srcdir}/build/sip/qt_gui_cpp_sip/Makefile in the PKGBUILD before make.