Package Details: ros-jade-collada-urdf 1.11.10-1

Git Clone URL: (read-only, click to copy)
Package Base: ros-jade-collada-urdf
Description: ROS - This package contains a tool to convert Unified Robot Description Format (URDF) documents into COLLAborative Design Activity (COLLADA) documents.
Upstream URL:
Licenses: BSD
Submitter: bchretien
Maintainer: None
Last Packager: bchretien
Votes: 1
Popularity: 0.000000
First Submitted: 2015-06-20 10:59
Last Updated: 2016-02-25 09:22

Latest Comments

bchretien commented on 2016-02-24 00:51

@alejandrogm: see (you need to recompile a bunch of packages)

agarciamontoro commented on 2016-02-23 17:46

The following error arose while linking collada_to_urdf. Any ideas of where the problem could come from? Would it be better if I post an issue in the GitHub repo of the package?

Scanning dependencies of target collada_to_urdf
[ 16%] Building CXX object CMakeFiles/collada_to_urdf.dir/src/collada_to_urdf.cpp.o
[ 33%] Linking CXX executable devel/lib/collada_urdf/collada_to_urdf
/usr/lib/gcc/i686-pc-linux-gnu/5.3.0/../../../ undefined reference to `pcrecpp::RE::Init(std::__cxx11::basic_string<char, std::char_traits<char>, std::allocator<char> > const&, pcrecpp::RE_Options const*)'
collect2: error: ld returned 1 exit status
CMakeFiles/collada_to_urdf.dir/build.make:145: recipe for target 'devel/lib/collada_urdf/collada_to_urdf' failed
make[2]: *** [devel/lib/collada_urdf/collada_to_urdf] Error 1
CMakeFiles/Makefile2:485: recipe for target 'CMakeFiles/collada_to_urdf.dir/all' failed
make[1]: *** [CMakeFiles/collada_to_urdf.dir/all] Error 2
Makefile:127: recipe for target 'all' failed
make: *** [all] Error 2

Thank you.