Package Details: rkt 1.30.0-1

Git Clone URL: (read-only, click to copy)
Package Base: rkt
Description: App container runtime
Upstream URL:
Licenses: Apache
Submitter: mtorromeo
Maintainer: None
Last Packager: mtorromeo
Votes: 0
Popularity: 0.000000
First Submitted: 2019-09-07 08:53
Last Updated: 2019-09-07 08:53

Latest Comments

stefanc_diff commented on 2019-10-30 13:40

Is this pkg able to build successfully for you ?

For me the build fails in a local systemd-nspawn clean chroot (created by the devtools archlinux pkg) Nothing obvious in any logfile as to why the compilation fails from the rkt PKGBUILD

In function ‘strncpy’,
    inlined from ‘find_kernel’ at builtin-run.c:298:3,
    inlined from ‘kvm_cmd_run_init’ at builtin-run.c:510:30:
/usr/include/bits/string_fortified.h:106:10: error: ‘__builtin_strncpy’ specified bound 4096 equals destination size [-Werror=stringop-truncation]
  106 |   return __builtin___strncpy_chk (__dest, __src, __len, __bos (__dest));
      |          ^~~~~~~~~~~~~~~~~~~~~~~~~~~~~~~~~~~~~~~~~~~~~~~~~~~~~~~~~~~~~~
cc1: all warnings being treated as errors
make[1]: *** [Makefile:423: builtin-run.static.o] Error 1
make: *** [stage1/usr_from_kvm/ /build/rkt/src/rkt-1.30.0/build-rkt-1.30.0/stamps/__stage1_us
r_from_kvm_lkvm_mk_build.stamp] Error 2
==> ERROR: A failure occurred in build().