Package Details: retroshare-git v0.6.6.RC1.r0.g4199b1a02-1

Git Clone URL: https://aur.archlinux.org/retroshare-git.git (read-only, click to copy)
Package Base: retroshare-git
Description: Serverless encrypted instant messenger with filesharing, chatgroups, e-mail.
Upstream URL: http://retroshare.cc/
Keywords: i2p retroshare tor
Licenses: GPL, LGPL
Conflicts: retroshare
Provides: retroshare
Submitter: sehraf
Maintainer: sehraf
Last Packager: sehraf
Votes: 19
Popularity: 0.000003
First Submitted: 2015-08-04 08:22
Last Updated: 2020-10-15 21:27

Required by (0)

Sources (1)

Latest Comments

« First ‹ Previous 1 2 3 4 5 6

Anonymous comment on 2012-07-16 15:39

@cousinm: looks like a bug in razor, but I made the change.

Anonymous comment on 2012-07-16 15:38

Updated for the new OpenPGP-SDK system. Doesn’t need libgpgme anymore. RetroShare will copy your GPG keyring from ~/.gpg/ to ~/.retroshare/pgp/. If your personal key isn’t RSA you’ll have to create a new one (DSA/ELG doesn’t work). At the time of writing the copy will fail if .retroshare is a symlink or if you’re using GNUPGHOME.

marco44 commented on 2012-04-14 17:10

Tiny little problem when under razor:

/usr/bin/retroshare is a script, but has no #!/bin/sh at the beginning. So running it fails.

Anonymous comment on 2012-04-07 02:42

I think it was caused by the GCC 4.7.0 update. Please try the new tarball, it should work now.

Anonymous comment on 2012-04-06 13:11

It is also strange that i was able to build the pkg 2 weeks ago. Idk what is wrong now.

Anonymous comment on 2012-04-06 12:21

Yes it does. I copied the whole code to pastebin. Hope it is ok.

http://pastebin.com/QR5gpcDW

Anonymous comment on 2012-04-06 02:05

cortuly, I don’t have such a problem here. Does the line just before the error look like that?

g++ -c -m64 -pipe -Wall -DBE_DEBUG -g -fno-omit-frame-pointer -march=x86-64 -mtune=generic -O2 -pipe -fstack-protector --param=ssp-buffer-size=4 -D_FORTIFY_SOURCE=2 -fPIC -Wall -W -I/usr/share/qt/mkspecs/linux-g++-64 -I. -I. -o temp/linux-g++-64/obj/udpbitdht.o udp/udpbitdht.cc

It’s true that udpbit.cc doesn’t include unistd.h that declares usleep() and sleep(), but that doesn’t explain why the error happens only on your computer...

Anonymous comment on 2012-04-04 13:01

Hi,

When building the pkg i always get this.

*udp/udpbitdht.cc: In member function ‘virtual void UdpBitDht::run()’:
*udp/udpbitdht.cc:322:26: error: ‘usleep’ was not declared in this scope
*udp/udpbitdht.cc:329:10: error: ‘sleep’ was not declared in this scope
*make: *** [temp/linux-g++-64/obj/udpbitdht.o] Error 1


It does not mind if i use this package, oder the normal retroshare version from aur. Can anyone please help me?

Anonymous comment on 2012-03-06 12:18

Added possibility to build retroshare-nogui (edit the PKGBUILD and set _build_nogui to true), and small improvements.

Anonymous comment on 2012-03-02 01:08

Added missing bdboot.txt to the package. If you don't want to rebuild, you should copy it to ~/.retroshare/<sslid>/
(Source file is at http://retroshare.svn.sourceforge.net/viewvc/retroshare/trunk/libbitdht/src/bitdht/bdboot.txt )