Package Details: qtwebkit 2.3.4-7

Git Clone URL: https://aur.archlinux.org/qtwebkit.git (read-only, click to copy)
Package Base: qtwebkit
Description: An open source web browser engine (Qt port)
Upstream URL: http://trac.webkit.org/wiki/QtWebKit
Licenses: GPL3, LGPL2.1
Conflicts: qt<4.8
Submitter: arojas
Maintainer: fbrennan
Last Packager: FredBezies
Votes: 54
Popularity: 0.180794
First Submitted: 2017-02-09 07:52
Last Updated: 2018-07-07 22:15

Sources (6)

Pinned Comments

FredBezies commented on 2018-02-05 17:10

@alban : so just use qtwebkit-bin package.

By the way, last time I build this package successfully? January 15th, 2018.

fred@fredo-arch ~ % pacman -Qi qtwebkit

name : qtwebkit

Version : 2.3.4-6

Description : An open source web browser engine (Qt port)

Architecture : x86_64

URL : http://trac.webkit.org/wiki/QtWebKit

Licenses : LGPL2.1 GPL3

Groups : None

Provides : None

Depends On : qt4 systemd gst-plugins-base-libs

Optional Deps : None

Required By : google-musicmanager

Optional For : None

Conflicts With : qt<4.8

Replaces : None

Installed Size : 35.26 MiB

Packager : Unknown Packager

Build Date : Mon Jan 15 10:41:57 2018

Install Date : Mon Jan 15 10:47:06 2018

Install Reason : Explicitly installed

Install Script : No

Validated By : None

Latest Comments

« First ‹ Previous 1 2 3 4 5 6 7 8 ... Next › Last »

Stillrotten commented on 2017-11-29 07:29

@mani.zaeim @severach Specifically what's happening to me is it'll get about 2 minutes in, and then it looks like it's repeating the same steps over and over again, until at about minute 13 my PC just shuts down (AMD FX-8370, 16GB ram). Doesn't seem to be hot at all. I can see a lot of messages that say something like "Warning: the use of "defined" may not be portable." Obviously I'd run a pastebin if I could but a) it would be long as all hell and, b) if my PC shuts down anyway that defeats the purpose.

mani.zaeim commented on 2017-11-29 02:54

@Stillrotten I face to same issue month ago, so on everyday update I just put it on the ignore list, after shutting down this problem happen https://bbs.archlinux.org/viewtopic.php?id=231345
the system start randomly after rebooting.
I use 16GB RAM and Corei7 CPU

severach commented on 2017-11-28 15:58

With 4 cores and 4 threads and compiling in /tmp it takes 30 minutes. Multiply that by 8. Use clean-chroot-manager and it will automatically use every core you have. Even doubling the speed with a dual core will be a big improvement.

Stillrotten commented on 2017-11-28 11:35

How long does this generally take to build? I've tried it normally and in a clean chroot but both times it goes on forever and eventually my pc just shuts down.

Scimmia commented on 2017-11-10 00:47

Renfield, re-read the AUR wiki page. They are not missing deps

Renfield commented on 2017-11-10 00:33

There are two missing dependencies:

ERROR: bison, flex missing but required to build WebKit.

kzoli429 commented on 2017-11-01 19:42

qwebview_plugin.cpp: In member function ‘virtual QWidget* QWebViewPlugin::createWidget(QWidget*)’:
qwebview_plugin.cpp:97:16: error: expected type-specifier before ‘QWebView’
return new QWebView(parent);
^~~~~~~~
qwebview_plugin.cpp:97:16: error: expected ‘;’ before ‘QWebView’
qwebview_plugin.cpp:97:16: error: ‘QWebView’ was not declared in this scope
make: *** [Makefile:244: qwebview_plugin.o] Error 1
==> ERROR: A failure occurred in build().
Aborting...

tc1384 commented on 2017-10-24 16:03

$ cd ~/.cache/pacaur/qtwebkit
$ multilib-build

Builds Successfully
qtwebkit-2.3.4-6-x86_64.pkg.tar.xz

FredBezies commented on 2017-10-23 07:49

@nipsky : useless log... There is no information related to what breaks compilation. Could be anything, like no remaining space in building in /tmp.

Will look at it.

nipsky commented on 2017-10-22 18:31

Hi, compilation fails for me with:

make[3]: *** [Makefile.WebCore.Target:52491: obj/release/JSDOMWindowCustom.o] Error 1
make[3]: Leaving directory '/tmp/yaourt-tmp-andre/aur-qtwebkit/src/qtwebkit-2.3.4/WebKitBuild/Release/Source/WebCore'
make[2]: *** [Makefile.WebCore:72: sub-Target-pri-make_default-ordered] Error 2
make[2]: Leaving directory '/tmp/yaourt-tmp-andre/aur-qtwebkit/src/qtwebkit-2.3.4/WebKitBuild/Release/Source/WebCore'
make[1]: *** [Makefile:153: sub-Source-WebCore-WebCore-pro-make_default-ordered] Error 2
make[1]: Leaving directory '/tmp/yaourt-tmp-andre/aur-qtwebkit/src/qtwebkit-2.3.4/WebKitBuild/Release'
make: *** [Makefile:406: incremental] Error 2