Package Details: qtcreator-prerelease 4.13.0beta2-1

Git Clone URL: (read-only, click to copy)
Package Base: qtcreator-prerelease
Description: Qt Creator prerelease/latest
Upstream URL:
Licenses: GPL
Conflicts: qtcreator
Provides: qtcreator
Submitter: sirspudd
Maintainer: sirspudd (jakepetroules)
Last Packager: sirspudd
Votes: 3
Popularity: 0.000000
First Submitted: 2016-03-25 23:15
Last Updated: 2020-07-30 19:48

Dependencies (24)

Required by (37)

Sources (3)

Latest Comments

« First ‹ Previous 1 2

sirspudd commented on 2017-07-24 18:43

@Hazzl It looks like your qbs is ill configured.

I will reintroduce the qmake configuration path as a configurable option, as qmake either works or does not (does not require configuration)

Hazzl commented on 2017-07-24 17:51

Package seems to be broken. I get

No build graph exists yet for this configuration.
Resolving project for configuration release
ERROR: /home/hazzl/tmp/qtcreator-prerelease/src/qt-creator-opensource-src-4.4.0-beta1/src/shared/qbs/src/app/qbs-setup-android/qbs-setup-android.qbs:3:1 Errors in product 'qbs-setup-android':
/home/hazzl/tmp/qtcreator-prerelease/src/qt-creator-opensource-src-4.4.0-beta1/src/shared/qbs/qbs-resources/imports/QbsProduct.qbs:6:5 Dependency 'Qt.core' not found for product 'qbs-setup-android'.

jmarch commented on 2017-05-09 14:18

Missing dependency: llvm for /usr/bin/llvm-config

sirspudd commented on 2016-05-20 07:33


I have added the debug args to the pkgbuild, just uncomment the _qmake_args line to get a debug build.

Needless to say I do not see this locally. The illegal instruction failing does not give me much hope of you seeing much in the way of a meaningful stack trace. You can see the instruction in question and manually research why it is making your machine barf, but I have primarily seen this kind of thing on ARM devices which are infinitely more heterogeneous.

Are you running the package on the machine you are building on? And if so, are you setting any env specific compiler flags which might build for a different target?

mage commented on 2016-05-20 04:12

Yep, now i can build a pkg. I've posted this bug I hoped that if i build from aur things will be different. But it's still the same.

`--> qtcreator
zsh: illegal hardware instruction (core dumped) qtcreator
`--> coredumpctl dump qtcreator
PID: 15066 (qtcreator)
UID: 1000 (mage)
GID: 100 (users)
Signal: 4 (ILL)
Timestamp: Пт 2016-05-20 07:09:30 MSK (2min 9s ago)
Command Line: qtcreator
Executable: /usr/bin/qtcreator
Control Group: /user.slice/user-1000.slice/session-c1.scope
Unit: session-c1.scope
Slice: user-1000.slice
Session: c1
Owner UID: 1000 (mage)
Boot ID: bfe6ea6b86ab4569ab3e68fadd43b21c
Machine ID: f52380f7ac7f46d8994a71a079492d43
Hostname: x120e
Coredump: /var/lib/systemd/coredump/core.qtcreator.1000.bfe6ea6b86ab4569ab3e68fadd43b21c.15066.1463717370000000000000.lz4
Message: Process 15066 (qtcreator) of user 1000 dumped core.

Stack trace of thread 15066:
#0 0x00007feb342620d1 n/a (n/a)
Refusing to dump core to tty.

How can I build qtcreator with debug symbols?

sirspudd commented on 2016-05-19 13:58

Just updated to final 4.0.0 Qt creator release, build appears to succeed so hopefully the reported issue is no longer manifest. Let me know accordingly.

mage commented on 2016-05-19 05:30

Trying to build this, i've got
In file included from cmbendmessage.cpp:26:0:
cmbendmessage.h:42:48: error: 'std::ostream' has not been declared
void PrintTo(const EndMessage &message, ::std::ostream* os);
Makefile:635: recipe for target '.obj/release-shared/cmbendmessage.o' failed
make[3]: *** [.obj/release-shared/cmbendmessage.o] Error 1
make[3]: Leaving directory '/home/mage/aur/qtcreator-prerelease/src/qt-creator-opensource-src-4.0.0-rc1/src/libs/clangbackendipc'
Makefile:386: recipe for target 'sub-clangbackendipc-make_first' failed
make[2]: *** [sub-clangbackendipc-make_first] Error 2
make[2]: Leaving directory '/home/mage/aur/qtcreator-prerelease/src/qt-creator-opensource-src-4.0.0-rc1/src/libs'
Makefile:311: recipe for target 'sub-libs-make_first-ordered' failed
make[1]: *** [sub-libs-make_first-ordered] Error 2
make[1]: Leaving directory '/home/mage/aur/qtcreator-prerelease/src/qt-creator-opensource-src-4.0.0-rc1/src'
Makefile:43: recipe for target 'sub-src-make_first-ordered' failed
make: *** [sub-src-make_first-ordered] Error 2
==> ERROR: A failure occurred in build().

Anyone have similar problems?