Package Details: qt5-location-595 5.9.5-3

Git Clone URL: https://aur.archlinux.org/qt5-location-595.git (read-only, click to copy)
Package Base: qt5-location-595
Description: Provides access to position, satellite and area monitoring classes (v5.9.5)
Upstream URL: http://qt-project.org/
Licenses: custom, GPL3, LGPL3, FDL
Submitter: cian1500ww
Maintainer: cian1500ww
Last Packager: cian1500ww
Votes: 0
Popularity: 0.000000
First Submitted: 2020-01-05 00:04
Last Updated: 2020-06-28 21:29

Latest Comments

cian1500ww commented on 2020-06-29 15:35

@timmyfromspace The compilation issue should be fixed now.

timmyfromspace commented on 2020-05-20 22:28

i get this error when compiling (gconf as dependency):


/build/qt5-location-595/src/qtlocation-opensource-src-5.9.5/src/3rdparty/mapbox-gl-native/platform/default/bidi.cpp:63:24: error: ‘runtime_error’ is not a member of ‘std’
   63 |             throw std::runtime_error(std::string("ProcessedBiDiText::mergeParagraphLineBreaks: ") +
      |                        ^~~~~~~~~~~~~
/home/tim/.cache/pikaur/build/qt5-location-595/src/qtlocation-opensource-src-5.9.5/src/3rdparty/mapbox-gl-native/platform/default/bidi.cpp: In member function ‘std::vector<std::__cxx11::basic_string<char16_t> > mbgl::BiDi::processText(const u16string&, std::set<long unsigned int>)’:
/home/tim/.cache/pikaur/build/qt5-location-595/src/qtlocation-opensource-src-5.9.5/src/3rdparty/mapbox-gl-native/platform/default/bidi.cpp:98:20: error: ‘runtime_error’ is not a member of ‘std’
   98 |         throw std::runtime_error(std::string("BiDi::processText: ") + u_errorName(errorCode));
      |                    ^~~~~~~~~~~~~
/home/tim/.cache/pikaur/build/qt5-location-595/src/qtlocation-opensource-src-5.9.5/src/3rdparty/mapbox-gl-native/platform/default/bidi.cpp: In member function ‘std::u16string mbgl::BiDi::getLine(std::size_t, std::size_t)’:
/home/tim/.cache/pikaur/build/qt5-location-595/src/qtlocation-opensource-src-5.9.5/src/3rdparty/mapbox-gl-native/platform/default/bidi.cpp:109:20: error: ‘runtime_error’ is not a member of ‘std’
  109 |         throw std::runtime_error(std::string("BiDi::getLine (setLine): ") + u_errorName(errorCode));
      |                    ^~~~~~~~~~~~~
/home/tim/.cache/pikaur/build/qt5-location-595/src/qtlocation-opensource-src-5.9.5/src/3rdparty/mapbox-gl-native/platform/default/bidi.cpp:125:20: error: ‘runtime_error’ is not a member of ‘std’
  125 |         throw std::runtime_error(std::string("BiDi::getLine (writeReordered): ") +
      |                    ^~~~~~~~~~~~~
make[4]: *** [Makefile:1992: .obj/platform/default/bidi.o] Error 1
make[4]: Leaving directory '/home/tim/.cache/pikaur/build/qt5-location-595/src/build/src/3rdparty/mapbox-gl-native'
make[3]: *** [Makefile:201: sub-------3rdparty-mapbox-gl-native-make_first] Error 2
make[3]: Leaving directory '/home/tim/.cache/pikaur/build/qt5-location-595/src/build/src/plugins/geoservices'
make[2]: *** [Makefile:71: sub-geoservices-make_first] Error 2
make[2]: Leaving directory '/home/tim/.cache/pikaur/build/qt5-location-595/src/build/src/plugins'
make[1]: *** [Makefile:205: sub-plugins-make_first] Error 2
make[1]: Leaving directory '/home/tim/.cache/pikaur/build/qt5-location-595/src/build/src'
make: *** [Makefile:47: sub-src-make_first] Error 2
==> ERROR: A failure occurred in build().
    Aborting...