Package Details: qgis-ltr 3.16.6-2

Git Clone URL: (read-only, click to copy)
Package Base: qgis-ltr
Description: Geographic Information System (GIS); Long Term Release
Upstream URL:
Keywords: GIS
Licenses: GPL
Conflicts: qgis
Provides: qgis=3.16.6
Submitter: saultdon
Maintainer: buzo
Last Packager: buzo
Votes: 14
Popularity: 0.000076
First Submitted: 2015-07-08 16:37
Last Updated: 2021-05-10 18:37

Required by (4)

Sources (2)

Latest Comments

« First ‹ Previous ... 2 3 4 5 6 7 8 Next › Last »

kikislater commented on 2017-03-25 15:09

Yes but I have saga-gis 4 installed !

Scimmia commented on 2017-03-25 14:21

It doesn't appear to support saga 2.3.1.

kikislater commented on 2017-03-25 11:25

There is a problem with processing now (I have saga from AUR ) :

Couldn't load plugin processing due to an error when calling its initGui() method

OSError: [Errno 2] No such file or directory: '/usr/share/qgis/python/plugins/processing/algs/saga/description/2.3.1'
Traceback (most recent call last):
File "/usr/share/qgis/python/qgis/", line 315, in startPlugin
File "/usr/share/qgis/python/plugins/processing/", line 57, in initGui
File "/usr/share/qgis/python/plugins/processing/core/", line 148, in initialize
File "/usr/share/qgis/python/plugins/processing/core/", line 165, in loadFromProviders
File "/usr/share/qgis/python/plugins/processing/core/", line 200, in loadAlgorithms
File "/usr/share/qgis/python/plugins/processing/core/", line 173, in updateProviders
File "/usr/share/qgis/python/plugins/processing/core/", line 54, in loadAlgorithms
File "/usr/share/qgis/python/plugins/processing/algs/saga/", line 107, in _loadAlgorithms
for descriptionFile in os.listdir(folder):
OSError: [Errno 2] No such file or directory: '/usr/share/qgis/python/plugins/processing/algs/saga/description/2.3.1'

Python version: 2.7.13 (default, Dec 21 2016, 07:16:46) [GCC 6.2.1 20160830]
QGIS version: 2.14.13-Essen Essen, exported

Python Path:

Scimmia commented on 2017-03-24 16:35

2.14.13 didn't fix our issues (I didn't expect it would), but Fedora had a patch! Guess I should have checked there a while ago. Let me know if there's any problems.

kikislater commented on 2017-03-23 12:38

Successfull build with downgrader package and downgrade to

Like aur qgis package
Extensions with qtwebkit does not work like streetview but doesn't really matter ...

Scimmia commented on 2017-03-08 14:31

Yes, I've been fighting the same error in the qgis package, but it aborts during build because of it. When this one built, I figure it was OK and went ahead and updated without thoroughly testing. Hopefully we'll get a fix from upstream soon.

mrejani commented on 2017-03-08 12:08

@scimmia initially some dependencies like "python2-sip pyqt4-common python2-pyqt4" had requested at their old versions, and compiling with the newest version caused errors about at 97%. Now I'm able to compile with the newest versions but when qgis starts appear this error:

Impossibile caricare PyQGIS. (Unable to load PyQGIS.)
Il supporto Python verrà disabilitato.(Python support will be disabled.)

Traceback (most recent call last):
File "", line 1, in
File "/usr/share/qgis/python/qgis/", line 36, in
from qgis.core import QgsFeature, QgsGeometry
File "/usr/share/qgis/python/qgis/core/", line 34, in
from qgis._core import *
RuntimeError: qgis._core cannot import type 'QList' from PyQt4.QtCore

Have you any suggestion?

kikislater commented on 2017-02-01 09:40

@Scimmia, what we should able to find in comments ? I've got the same error !
I think it's related to this :

Scimmia commented on 2017-01-27 22:39

Yes, known issue, see comments under the QGIS package

ingleandrobarros commented on 2017-01-27 19:44

Brother have ERROR, don't compile. Check that:

/tmp/yaourt-tmp-leand/aur-qgis-ltr/src/qgis-2.14.11/build/python/gui/sip_guipart0.cpp: In member function ‘virtual QValidator::State sipQgsDateTimeEdit::validate(QString&, int&) const’:
/tmp/yaourt-tmp-leand/aur-qgis-ltr/src/qgis-2.14.11/build/python/gui/sip_guipart0.cpp:15811:25: error: ‘sipName_QString’ was not declared in this scope

/tmp/yaourt-tmp-leand/aur-qgis-ltr/src/qgis-2.14.11/build/python/gui/sip_guipart0.cpp:15818:25: error: ‘sipName_QString’ was not declared in this scope
make[2]: *** [python/CMakeFiles/python_module_qgis__gui.dir/build.make:594: python/CMakeFiles/python_module_qgis__gui.dir/gui/sip_guipart0.cpp.o] Error 1
make[1]: *** [CMakeFiles/Makefile2:3677: python/CMakeFiles/python_module_qgis__gui.dir/all] Error 2
make: *** [Makefile:150: all] Error 2
==> ERROR: A failure occurred in build().
==> ERROR: Makepkg was unable to build qgis-ltr.