Package Details: python35 3.5.9-4

Git Clone URL: https://aur.archlinux.org/python35.git (read-only, click to copy)
Package Base: python35
Description: Next generation of the python high-level scripting language
Upstream URL: https://www.python.org/
Keywords: python python3
Licenses: custom
Submitter: sdamashek
Maintainer: greut
Last Packager: greut
Votes: 20
Popularity: 0.012965
First Submitted: 2015-05-25 18:11
Last Updated: 2020-05-25 16:42

Latest Comments

1 2 Next › Last »

greut commented on 2020-08-04 18:51

@Vyre the key didn't change, I guess you'll have to trust Larry's key to get it to work.

gpg --keyserver pool.sks-keyservers.net --recv-keys 3A5CA953F73C700D

Vyre commented on 2020-08-04 15:28

I'm getting

Python-3.5.9.tar.xz ... FAILED (unknown public key 3A5CA953F73C700D)

Do keys need to be updated, or this on my end?

Quatro commented on 2020-05-25 15:06

Thanks @ingolemo. That works.

ingolemo commented on 2020-05-25 14:55

The validpgpkeys line is incorrect; it's "pgp" not "gpg", and the key id should not contain any spaces:

validpgpkeys=('97FC712E4C024BBEA48A61ED3A5CA953F73C700D')

somini commented on 2020-04-13 15:01

This needs a pkgrel bump since libffi was updated.

makeworld commented on 2020-03-31 14:56

Also, maybe it should have --without-ensurepip like the python36 package.

sebschrader commented on 2019-12-28 18:52

Building the nis module fails, because glibc removed the necessary headers:

building 'nis' extension
gcc -pthread -fPIC -Wno-unused-result -Wsign-compare -DDYNAMIC_ANNOTATIONS_ENABLED=1 -DNDEBUG -g -fwrapv -O3 -Wall -Wstrict-prototypes -march=x86-64 -mtune=generic -O2 -pipe -fstack-protector-strong -fno-plt -march=x86-64 -mtune=generic -O2 -pipe -fstack-protector-strong -fno-plt -Werror=declaration-after-statement -I./Include -I. -I/usr/local/include -I/home/scs/.cache/aurman/python35/src/Python-3.5.9/Include -I/home/scs/.cache/aurman/python35/src/Python-3.5.9 -c /home/scs/.cache/aurman/python35/src/Python-3.5.9/Modules/nismodule.c -o build/temp.linux-x86_64-3.5/home/scs/.cache/aurman/python35/src/Python-3.5.9/Modules/nismodule.o
/home/scs/.cache/aurman/python35/src/Python-3.5.9/Modules/nismodule.c:17:10: fatal error: rpc/rpc.h: No such file or directory
   17 | #include <rpc/rpc.h>
      |          ^~~~~~~~~~~
compilation terminated.

snip

building 'nis' extension
gcc -pthread -DDYNAMIC_ANNOTATIONS_ENABLED=1 -DNDEBUG -g -fwrapv -O3 -Wall -Wstrict-prototypes -march=x86-64 -mtune=generic -O2 -pipe -fstack-protector-strong -fno-plt -D_FORTIFY_SOURCE=2 -fPIC -I./Include -I. -I/usr/local/include -I/home/scs/.cache/aurman/python35/src/Python-3.5.9/Include -I/home/scs/.cache/aurman/python35/src/Python-3.5.9 -c /home/scs/.cache/aurman/python35/src/Python-3.5.9/Modules/nismodule.c -o build/temp.linux-x86_64-3.5/home/scs/.cache/aurman/python35/src/Python-3.5.9/Modules/nismodule.o
ERROR: ld.so: object 'libfakeroot.so' from LD_PRELOAD cannot be preloaded (cannot open shared object file): ignored.
ERROR: ld.so: object 'libfakeroot.so' from LD_PRELOAD cannot be preloaded (cannot open shared object file): ignored.
ERROR: ld.so: object 'libfakeroot.so' from LD_PRELOAD cannot be preloaded (cannot open shared object file): ignored.
/home/scs/.cache/aurman/python35/src/Python-3.5.9/Modules/nismodule.c:17:10: fatal error: rpc/rpc.h: No such file or directory
   17 | #include <rpc/rpc.h>
      |          ^~~~~~~~~~~
compilation terminated.
The following modules found by detect_modules() in setup.py, have been
built by the Makefile instead, as configured by the Setup files:
atexit                pwd                   time               

Failed to build these modules:
nis                                                            

I've backported the upstream fix for Python 3.6 that allows Python to build the nis module against libnsl and libtirpc instead. You can find the necessary changes in my fork of this package.

lybin commented on 2018-08-07 08:29

==> WARNING: Package contains reference to $srcdir usr/lib/python3.5/pycache/_sysconfigdata.cpython-35.opt-1.pyc usr/lib/python3.5/pycache/_sysconfigdata.cpython-35.opt-2.pyc usr/lib/python3.5/pycache/_sysconfigdata.cpython-35.pyc usr/lib/python3.5/_sysconfigdata.py usr/lib/python3.5/lib-dynload/_ssl.cpython-35m-x86_64-linux-gnu.so usr/lib/python3.5/lib-dynload/_tkinter.cpython-35m-x86_64-linux-gnu.so usr/lib/python3.5/lib-dynload/pyexpat.cpython-35m-x86_64-linux-gnu.so usr/lib/python3.5/lib-dynload/_gdbm.cpython-35m-x86_64-linux-gnu.so usr/lib/python3.5/lib-dynload/array.cpython-35m-x86_64-linux-gnu.so usr/lib/python3.5/lib-dynload/_decimal.cpython-35m-x86_64-linux-gnu.so usr/lib/python3.5/lib-dynload/parser.cpython-35m-x86_64-linux-gnu.so usr/lib/python3.5/config-3.5m/Makefile usr/lib/libpython3.5m.so.1.0

sdamashek commented on 2018-02-15 18:39

@sangy updated the urls to https! Thanks for pointing that out.

sangy commented on 2018-02-14 23:11

Can we please change the url from http to https? :)