Package Details: python2-thunarx 1:0.5.1-1

Git Clone URL: https://aur.archlinux.org/thunarx-python.git (read-only, click to copy)
Package Base: thunarx-python
Description: Thunarx Python 2 Bindings
Upstream URL: http://goodies.xfce.org/projects/bindings/thunarx-python
Licenses: GPL
Conflicts: thunarx-python
Provides: thunarx-python=0.5.1
Replaces: thunarx-python
Submitter: None
Maintainer: twa022
Last Packager: twa022
Votes: 58
Popularity: 0.000000
First Submitted: 2010-02-13 16:34
Last Updated: 2018-02-17 03:13

Pinned Comments

twa022 commented on 2017-12-29 03:43

Version 0.5.0 supports python2 and python3. Changed PKGBUILD to split package to python-thunarx and python2-thunarx. Currently they are not coinstallable. Both require thunar>=1.7.0. If you need python-thunarx for thunarx-2 (GTK2 thunar < 1.7.0), please install python-thunarx-0.3

Latest Comments

1 2 Next › Last »

MrBlister commented on 2020-05-21 11:06

I symlinked the python bin to /usr/local/bin as @smallpotato suggested to fix the "configure: error: could not find Python lib" error, but the build fails:

/usr/bin/ld: .libs/thunarx_python_la-thunarx-python-object.o:(.bss+0x58): multiple definition of `_PyGtkWidget_Type'; .libs/thunarx_python_la-thunarx-python.o:(.bss+0x58): first defined here collect2: error: ld returned 1 exit status make[2]: [Makefile:476: thunarx-python.la] Error 1 make[2]: Leaving directory '/home/tony/.cache/yay/thunarx-python/src/thunarx-python-0.5.1/src' make[1]: [Makefile:441: all-recursive] Error 1 make[1]: Leaving directory '/home/tony/.cache/yay/thunarx-python/src/thunarx-python-0.5.1' make: *** [Makefile:371: all] Error 2 ==> ERROR: A failure occurred in build().

gilcu3 commented on 2020-03-28 10:36

@smallpotato why is it necessary to do this?

@nobodyinperson create a symlink to your python bin in /usr/local/bin to fix the issue

shouldn't it be fixed in package? @twa022?

dedguy21 commented on 2020-02-21 18:12

I don't know what dependencies I'm missing, but I get the following error when trying to install?

libraries required to embed python....no

what libraries would be missing?

smallpotato commented on 2020-02-02 22:16

@nobodyinperson create a symlink to your python bin in /usr/local/bin to fix the issue

nobodyinperson commented on 2020-01-19 16:29

Version 0.5.1-1 fails at the configure step:

checking for libraries required to embed python... no
configure: error: could not find Python lib

twa022 commented on 2017-12-29 03:43

Version 0.5.0 supports python2 and python3. Changed PKGBUILD to split package to python-thunarx and python2-thunarx. Currently they are not coinstallable. Both require thunar>=1.7.0. If you need python-thunarx for thunarx-2 (GTK2 thunar < 1.7.0), please install python-thunarx-0.3

dcelasun commented on 2017-11-30 15:52

I'm orphaning this package as I no longer use Xfce. The next version introduces GTK3 support and is NOT backwards compatible with the previous one.

If you are interested in dealing with that somehow and updating this package, please adopt the package.

dcelasun commented on 2017-07-31 14:10

@Plexcon: You seem to be trying to use an old version? That line should be like this:

checking for thunarx-2 >= 1.1.0... 1.6.12

Please make sure your system is up-to-date.

Plexcon commented on 2017-07-30 19:49

No package 'thunarx-1' found
checking for thunarx-1 >= 0.4.0... not found
*** The required package thunarx-1 was not found on your system.
*** Please install thunarx-1 (atleast version 0.4.0) or adjust
*** the PKG_CONFIG_PATH environment variable if you
*** installed the package in a nonstandard prefix so that
*** pkg-config is able to find it.
==> ERROR: Se produjo un fallo en build().
Cancelando...

dcelasun commented on 2017-07-07 13:13

@notuxius: Naturally, because "thunar-gtk3" is not in the repos. If you want to use an AUR version of a dependency that exists in the repos, you need to manually install it first (with --asdeps flag), and then build thunarx-python.