Package Details: python2-sipsimple 3.1.1-5

Git Clone URL: https://aur.archlinux.org/python2-sipsimple.git (read-only)
Package Base: python2-sipsimple
Description: Python SDK for development of SIP end-points
Upstream URL: http://download.ag-projects.com/SipClient
Keywords: SIP
Licenses: LGPL, custom:MIT
Submitter: promike
Maintainer: ljmf00
Last Packager: Niklas
Votes: 7
Popularity: 0.135113
First Submitted: 2016-06-01 14:02
Last Updated: 2018-08-19 21:47

Latest Comments

« First ‹ Previous 1 2 3 4 5

theforeigner commented on 2016-08-02 15:13

@promike

Yep, it was either ffmpeg v3 or any of its dependencies that caused the error. Downgraded to v2.8 and had no trouble building python2-sipsimple and could then upgrade back to ffmpeg v3.1.1 again.

promike commented on 2016-08-01 22:07

@theforeigner

There's a dependency list in the 'docs' folder (./docs/Dependencies.txt), but never mind I post it here:
https://ptpb.pw/u8V-

I've removed python2-sipsimple entirely from my computer, and I've also installed that notorious yaourt.
I could reinstall sipsimple without any friction or hassle.
It's also worth mentioning that the package 'ffmpeg2.8' is installed on my computer. Frankly I don't remember the reason why.
If you suspect that something is wrong with ffmpeg (3.1.1), try ffmpeg2.8, and tell me your experiences.

theforeigner commented on 2016-08-01 08:21

I'm unable to build this, even with ffmpeg installed. Does the package require ffmpeg v2.x by any chance, as I'm using v3.1.1? The summary of the error I get is:

make[2]: *** [/tmp/yaourt-tmp-xx/aur-python2-sipsimple/src/python-sipsimple-3.0.0/build/temp.linux-x86_64-2.7/pjsip/build/rules.mak:147: output/pjmedia-codec-x86_64-unknown-linux-gnu/openh264.o] Error 1
make[1]: *** [Makefile:165: pjmedia-codec] Error 2

ogarcia commented on 2016-06-18 11:25

Hi!

You forget to add `ffmpeg` as dependency and in a pristine build environment gives the following error.

==> Making package: python2-sipsimple 3.0.0-4 (Sat Jun 18 11:12:38 UTC 2016)
==> Checking runtime dependencies...
==> Checking buildtime dependencies...
==> Retrieving sources...
-> Downloading python-sipsimple-3.0.0.tar.gz...
% Total % Received % Xferd Average Speed Time Time Time Current
Dload Upload Total Spent Left Speed
100 4669k 100 4669k 0 0 6863k 0 --:--:-- --:--:-- --:--:-- 6856k
==> Validating source files with md5sums...
python-sipsimple-3.0.0.tar.gz ... Passed
==> Extracting sources...
-> Extracting python-sipsimple-3.0.0.tar.gz with bsdtar
==> Starting build()...
running build_ext
Compiling Cython extension sipsimple.core._core
Cleaning PJSIP
Configuring PJSIP
Traceback (most recent call last):
File "setup.py", line 53, in <module>
provides=['sipsimple']
File "/usr/lib/python2.7/distutils/core.py", line 151, in setup
dist.run_commands()
File "/usr/lib/python2.7/distutils/dist.py", line 953, in run_commands
self.run_command(cmd)
File "/usr/lib/python2.7/distutils/dist.py", line 972, in run_command
cmd_obj.run()
File "/usr/lib/python2.7/site-packages/Cython/Distutils/build_ext.py", line 164, in run
_build_ext.build_ext.run(self)
File "/usr/lib/python2.7/distutils/command/build_ext.py", line 339, in run
self.build_extensions()
File "/usr/lib/python2.7/site-packages/Cython/Distutils/build_ext.py", line 171, in build_extensions
ext.sources = self.cython_sources(ext.sources, ext)
File "/tmp/sip/src/python-sipsimple-3.0.0/setup_pjsip.py", line 218, in cython_sources
self.configure_pjsip()
File "/tmp/sip/src/python-sipsimple-3.0.0/setup_pjsip.py", line 170, in configure_pjsip
self.distutils_exec_process(cmd, silent=not self.pjsip_verbose_build, cwd=self.build_dir, env=env)
File "/tmp/sip/src/python-sipsimple-3.0.0/setup_pjsip.py", line 104, in distutils_exec_process
raise RuntimeError('Got return value %d while executing "%s", stderr output was:\n%s' % (returncode, " ".join(cmdline), stderr.rstrip("\n")))
RuntimeError: Got return value 1 while executing "./configure --disable-g7221-codec", stderr output was:
aconfigure: error: *** Error: libavformat not detected ***
==> ERROR: A failure occurred in build().
Aborting...

Please add `ffmpeg` as dependecy. Thanks in advance.

promike commented on 2016-06-15 08:37

@ashaman-crypto
I wish I could be more help.
If you find anything suspicious in the PKGBUILD, feel free to notify me.

You can also ask for help here: http://lists.ag-projects.com/mailman/listinfo/blink

ashaman-crypto commented on 2016-06-14 06:11

Nope. Nothing exotic. I was able to build it on without issue on one of my other arch boxes and transfered to the one that was getting the error.

promike commented on 2016-06-02 13:02

@ashaman-crypto
No clue, I can compile it everywhere, though I don't use yaourt.
Do you use some exotic variant of the Archlinux, like Manjaro or Antergos?

ashaman-crypto commented on 2016-06-01 21:04

` File "Cython/Compiler/FlowControl.py", line 418, in Cython.Compiler.FlowControl.NameReference.__deepcopy__ (/tmp/yaourt-tmp-joe/aur-cython2-kivy/src/Cython-0.23/Cython/Compiler/FlowControl.c:13685)
File "/usr/lib/python2.7/copy.py", line 190, in deepcopy
y = _reconstruct(x, rv, 1, memo)
File "/usr/lib/python2.7/copy.py", line 328, in _reconstruct
args = deepcopy(args, memo)
File "/usr/lib/python2.7/copy.py", line 163, in deepcopy
y = copier(x, memo)
File "/usr/lib/python2.7/copy.py", line 237, in _deepcopy_tuple
y.append(deepcopy(a, memo))
RuntimeError: maximum recursion depth exceeded
==> ERROR: A failure occurred in build().
Aborting...
==> ERROR: Makepkg was unable to build python2-sipsimple.

On the most recent version