Package Details: psi-plus-git 1.4.1026.r1151.g2170e90-1

Git Clone URL: https://aur.archlinux.org/psi-plus-git.git (read-only, click to copy)
Package Base: psi-plus-git
Description: Psi+ is a powerful XMPP client (Qt, C++) designed for the XMPP power users (built with Qt 5.x)
Upstream URL: https://psi-plus.com
Licenses: GPL2
Conflicts: psi-plus, psi-plus-qt5-git, psi-plus-webkit-git, psi-plus-webkit-qt5-git
Provides: psi-plus=1.4.1026.r1151.g2170e90, psi-plus-qt5-git=1.4.1026.r1151.g2170e90
Submitter: TZ86
Maintainer: sir_lucjan (el_aur)
Last Packager: sir_lucjan
Votes: 138
Popularity: 0.120250
First Submitted: 2013-08-06 17:06
Last Updated: 2020-02-25 15:47

Latest Comments

« First ‹ Previous 1 2 3 4 5 6 7 8 9 10 ... Next › Last »

el_aur commented on 2016-04-06 09:40

Package available on my custom binary repo (x86_64 only)
[el]
SigLevel = Never
Server = https://dl.dropboxusercontent.com/u/51057584/archrepo/$arch

vdg commented on 2016-04-01 23:21

@TZ86 Yeap, build success.

May be a corrupt state in psi project from a few days ago.

Edit: broken again? (different error:)

patching file src/avcall/avcall.cpp
Hunk #1 FAILED at 117.
1 out of 1 hunk FAILED -- saving rejects to file src/avcall/avcall.cpp.rej


Edit2: Now works again. Probably was because of:

>>> https://github.com/psi-im/psi/commit/6533b45b02547aef7a3f53e5f0e0fcaa590ee1d3

TZ86 commented on 2016-03-31 05:37

@vdg
@s123
Seems to be fixed now.

s123 commented on 2016-03-29 11:49

I have exactly the same error as vdg and can't build too on 2 different systems. A few months ago it was working, now it's broken(

vdg commented on 2016-03-29 02:16

Hi! I can't build too.
http://pastebin.com/DNWemw7u
Someone has a clue?

madmaurice commented on 2015-12-14 14:12

You swapped two digits in the version.
It says 475 but compiles 457

EDIT: My mistake. i thought it was installed already.

korobcov commented on 2015-06-03 21:18

fixed pkgbuild http://pastebin.archlinux.fr/1047247

digital commented on 2015-05-21 10:32

collect2: error: ld returned 1 exit status
Makefile:1148: recipe for target '/tmp/yaourt-tmp-user/aur-psi-plus-git/src/psi/psi-plus' failed
make[1]: *** [/tmp/yaourt-tmp-user/aur-psi-plus-git/src/psi/psi-plus] Error 1
make[1]: Leaving directory '/tmp/yaourt-tmp-user/aur-psi-plus-git/src/psi/src'
Makefile:62: recipe for target 'sub-src-make_default' failed
make: *** [sub-src-make_default] Error 2
==> ERROR: A failure occurred in build().
Aborting...
==> ERROR: Makepkg was unable to build psi-plus-git.
==> Restart building psi-plus-git ? [y/N]
==> -------------------------------------
==>

TZ86 commented on 2015-02-22 06:59

@s0k0ban
What exactly compilation errors are you getting? It will be nice, if you save all build log to pastebin.com and put link there.

s0k0ban commented on 2015-02-22 01:26

There is a regression in the latest version of Psi-plus (0.16.448) which leads to multiple compilation errors on Arch.
Fixing one error (by commenting the problematic parts from the source) leads to others, I gave up.
Anyone?