Package Details: polybar-git 3.4.0-4

Git Clone URL: https://aur.archlinux.org/polybar-git.git (read-only, click to copy)
Package Base: polybar-git
Description: A fast and easy-to-use status bar
Upstream URL: https://github.com/polybar/polybar
Keywords: bar bspwm i3 lemonbar lemonbuddy polybar
Licenses: MIT
Conflicts: polybar
Provides: polybar
Submitter: jaagr
Maintainer: jaagr (NBonaparte, patrick96)
Last Packager: patrick96
Votes: 45
Popularity: 0.55
First Submitted: 2016-11-19 05:07
Last Updated: 2019-12-23 22:53

Latest Comments

1 2 3 4 Next › Last »

patrick96 commented on 2020-01-31 06:14

@milk Thanks, fixed

milk commented on 2020-01-30 23:28

polybar-git currently fails when make with mkchrootpkg / testing-x86_64-build

-- Configuring done
-- Generating done
-- Build files have been written to: /build/polybar-git/src/polybar/build
Scanning dependencies of target doc_html
[  1%] sphinx-build html: see doc/builder-html.log
WARNING: html_static_path entry '/build/polybar-git/src/polybar/doc/_static' does not exist
[  1%] Built target doc_html
Scanning dependencies of target doc_man
[  2%] sphinx-build man: see doc/builder-man.log
WARNING: html_static_path entry '/build/polybar-git/src/polybar/doc/_static' does not exist
[  2%] Built target doc_man
Scanning dependencies of target doc
[  2%] Built target doc
[  3%] Generating ../../../lib/xpp/include/xpp/proto/x.hpp
Traceback (most recent call last):
  File "/build/polybar-git/src/polybar/lib/xpp/generators/cpp_client.py", line 3193, in <module>
    module.generate()
  File "/usr/lib/python3.8/site-packages/xcbgen/state.py", line 126, in generate
    item.out(name)
  File "/build/polybar-git/src/polybar/lib/xpp/generators/cpp_client.py", line 3007, in cpp_event
    cpp_event = CppEvent(self.opcodes[name], opcode, c_name, _ns, name, self.fields)
  File "/build/polybar-git/src/polybar/lib/xpp/generators/cppevent.py", line 207, in __init__
    for name in self.names[0:-1]:
TypeError: 'map' object is not subscriptable
make[2]: *** [lib/xpp/CMakeFiles/xpp.dir/build.make:74: ../lib/xpp/include/xpp/proto/x.hpp] Error 1
make[2]: *** Deleting file '../lib/xpp/include/xpp/proto/x.hpp'
make[1]: *** [CMakeFiles/Makefile2:521: lib/xpp/CMakeFiles/xpp.dir/all] Error 2
make: *** [Makefile:130: all] Error 2
==> ERROR: A failure occurred in build().

patrick96 commented on 2019-10-05 14:42

@nicocot best ask the pamac people. But generally removing the build directory pamac used for polybar should force pamac to recompile

nicocot commented on 2019-10-05 14:36

@patrick96 I'm using pamac-manager and I don't know how to recompile with this package manager. I removed and reinstalled the polybar-git package several times with pamac-manager, without success.

patrick96 commented on 2019-10-05 14:30

@nicocot Please only use the symlink method as a last resort when you can't recompile. It could potentially break other programs.

nicocot commented on 2019-10-05 14:29

I fixed the issue with the symlink method: sudo ln -s /usr/lib/libjsoncpp.so.21 /usr/lib/libjsoncpp.so.20

https://github.com/polybar/polybar/wiki/Known-Issues#error-while-loading-shared-libraries-libjsoncpp

https://www.shellhacks.com/symlink-create-symbolic-link-linux/

No other package has broken so far.

patrick96 commented on 2019-09-19 13:13

@zack6849 neither, recompiling polybar will fix it. See https://github.com/polybar/polybar/wiki/Known-Issues#error-while-loading-shared-libraries-libjsoncpp

zack6849 commented on 2019-09-19 12:34

Latest revision isn't working, I get the following when trying to run it:

polybar: error while loading shared libraries: libjsoncpp.so.20: cannot open shared object file: No such file or directory

Is this an issue with your package or upstream?

Thanks.

overlysalty commented on 2019-09-18 18:53

I had the same issue as @clpwn due to pyenv. Fixed by running "pyenv global system" before building.

haawda commented on 2019-09-09 21:05

Builds fine without i3-wm installed.