Package Details: playonlinux5-git r2553.b523e3f9e-1

Git Clone URL: https://aur.archlinux.org/playonlinux5-git.git (read-only, click to copy)
Package Base: playonlinux5-git
Description: GUI for managing Windows programs under linux (development version based on Java)
Upstream URL: http://www.playonlinux.com/
Keywords: playonlinux playonlinux5 pol pol5 wine
Licenses: GPL
Submitter: captain
Maintainer: None
Last Packager: TheGoliath
Votes: 27
Popularity: 0.000000
First Submitted: 2015-11-13 11:07
Last Updated: 2020-05-16 12:57

Dependencies (7)

Required by (0)

Sources (3)

Latest Comments

1 2 3 4 5 6 ... Next › Last »

tuxayo commented on 2020-06-19 00:43

It was a first install, is this expected?

(it was uninstalled since a long time)

TheGoliath commented on 2020-06-18 22:31

https://github.com/PhoenicisOrg/phoenicis/blob/master/README.md#build-and-run-locally

TheGoliath commented on 2020-06-18 22:30

Did you already recompile?

tuxayo commented on 2020-06-18 21:29

Does anyone else has this error?

Running compatible JVM already (default set): java-14-openjdk
Using: java-14-openjdk
JavaFX Capabale? True
JAVA_HOME: /usr/lib/jvm/default
Launching PlayOnLinux5
Error: JavaFX runtime components are missing, and are required to run this application

Even though I have java-openjfx 14.0.2.u0-2 installed

TheGoliath commented on 2020-05-16 12:58

Package fixed and updated

SolarAquarion commented on 2020-02-20 03:32

you need to update the script i think

zwastik commented on 2019-11-21 03:32

upstream suggest "mvn clean package -DskipTests" This allows build but package() fails:

[INFO] BUILD SUCCESS                                                                                                                    
[INFO]   ------------------------------------------------------------------------                                                         
[INFO] Total time:  04:16 min                                                                                                           
[INFO] Finished at: 2019-11-20T19:13:08-03:00                                                                                           
[INFO] ------------------------------------------------------------------------                                                         
==> Entering fakeroot environment...                                                                                                    
==> Starting package()...                                                                                                               
bsdtar: Error opening archive: Failed to open 'playonlinux5/phoenicis-dist/target/phoenicis.zip'                                        
==> ERROR: A failure occurred in package().                                                                                             
Aborting...

Command 'makepkg --force' failed to execute.

zwastik commented on 2019-11-20 20:08

Can't build:

[INFO] -------------------------------------------------------

[INFO] T E S T S

[INFO] -------------------------------------------------------

[INFO] Running org.phoenicis.javafx.AppConfigurationInitialisationTest java.util.concurrent.TimeoutException at java.base/java.util.concurrent.FutureTask.get(FutureTask.java:204) at org.testfx.util.WaitForAsyncUtils$ASyncFXCallable.get(WaitForAsyncUtils.java:715) at org.testfx.util.WaitForAsyncUtils.waitFor(WaitForAsyncUtils.java:298) at org.testfx.api.FxToolkit.waitForSetup(FxToolkit.java:245) at org.testfx.api.FxToolkit.setupFixture(FxToolkit.java:202) at org.phoenicis.javafx.AppConfigurationInitialisationTest.testAppConfigurationInitialisation(AppConfigurationInitialisationTest.java:49) at java.base/jdk.internal.reflect.NativeMethodAccessorImpl.invoke0(Native Method) at java.base/jdk.internal.reflect.NativeMethodAccessorImpl.invoke(NativeMethodAccessorImpl.java:62) at java.base/jdk.internal.reflect.DelegatingMethodAccessorImpl.invoke(DelegatingMethodAccessorImpl.java:43) at java.base/java.lang.reflect.Method.invoke(Method.java:567) at org.junit.runners.model.FrameworkMethod$1.runReflectiveCall(FrameworkMethod.java:50) at org.junit.internal.runners.model.ReflectiveCallable.run(ReflectiveCallable.java:12) at org.junit.runners.model.FrameworkMethod.invokeExplosively(FrameworkMethod.java:47) at org.junit.internal.runners.statements.InvokeMethod.evaluate(InvokeMethod.java:17) at org.junit.runners.ParentRunner.runLeaf(ParentRunner.java:325) at org.junit.runners.BlockJUnit4ClassRunner.runChild(BlockJUnit4ClassRunner.java:78) at org.junit.runners.BlockJUnit4ClassRunner.runChild(BlockJUnit4ClassRunner.java:57) at org.junit.runners.ParentRunner$3.run(ParentRunner.java:290) at org.junit.runners.ParentRunner$1.schedule(ParentRunner.java:71) at org.junit.runners.ParentRunner.runChildren(ParentRunner.java:288) at org.junit.runners.ParentRunner.access$000(ParentRunner.java:58) at org.junit.runners.ParentRunner$2.evaluate(ParentRunner.java:268) at org.junit.internal.runners.statements.RunBefores.evaluate(RunBefores.java:26) at org.junit.runners.ParentRunner.run(ParentRunner.java:363) at org.apache.maven.surefire.junit4.JUnit4Provider.execute(JUnit4Provider.java:365) at org.apache.maven.surefire.junit4.JUnit4Provider.executeWithRerun(JUnit4Provider.java:273) at org.apache.maven.surefire.junit4.JUnit4Provider.executeTestSet(JUnit4Provider.java:238) at org.apache.maven.surefire.junit4.JUnit4Provider.invoke(JUnit4Provider.java:159) at org.apache.maven.surefire.booter.ForkedBooter.invokeProviderInSameClassLoader(ForkedBooter.java:384) at org.apache.maven.surefire.booter.ForkedBooter.runSuitesInProcess(ForkedBooter.java:345) at org.apache.maven.surefire.booter.ForkedBooter.execute(ForkedBooter.java:126) at org.apache.maven.surefire.booter.ForkedBooter.main(ForkedBooter.java:418)

[ERROR] Tests run: 1, Failures: 1, Errors: 0, Skipped: 0, Time elapsed: 30.787 s <<< FAILURE! - in org.phoenicis.javafx.AppConfigurationInitialisationTest

[ERROR] testAppConfigurationInitialisation(org.phoenicis.javafx.AppConfigurationInitialisationTest) Time elapsed: 30.494 s <<< FAILURE! java.lang.AssertionError at org.phoenicis.javafx.AppConfigurationInitialisationTest.testAppConfigurationInitialisation(AppConfigurationInitialisationTest.java:52)

[INFO]

[INFO] Results:

[INFO]

[ERROR] Failures:

[ERROR] AppConfigurationInitialisationTest.testAppConfigurationInitialisation:52

[INFO]

[ERROR] Tests run: 1, Failures: 1, Errors: 0, Skipped: 0

[INFO]

[INFO] ------------------------------------------------------------------------

[INFO] Reactor Summary for phoenicis 5.0-SNAPSHOT:

[INFO]

[INFO] phoenicis .......................................... SUCCESS [ 2.514 s]

[INFO] phoenicis-configuration ............................ SUCCESS [ 12.942 s]

[INFO] phoenicis-entities ................................. SUCCESS [ 2.003 s]

[INFO] phoenicis-multithreading ........................... SUCCESS [ 2.316 s]

[INFO] phoenicis-win32 .................................... SUCCESS [ 1.659 s]

[INFO] phoenicis-tools .................................... SUCCESS [ 11.505 s]

[INFO] phoenicis-repository ............................... SUCCESS [ 3.744 s]

[INFO] phoenicis-scripts .................................. SUCCESS [ 0.392 s]

[INFO] phoenicis-library .................................. SUCCESS [ 0.259 s]

[INFO] phoenicis-engines .................................. SUCCESS [ 0.284 s]

[INFO] phoenicis-settings ................................. SUCCESS [ 0.145 s]

[INFO] phoenicis-containers ............................... SUCCESS [ 0.253 s]

[INFO] phoenicis-javafx ................................... FAILURE [ 35.008 s]

[INFO] phoenicis-cli ...................................... SKIPPED

[INFO] phoenicis-dist ..................................... SKIPPED

[INFO] phoenicis-tests .................................... SKIPPED

[INFO] ------------------------------------------------------------------------

[INFO] BUILD FAILURE

[INFO] ------------------------------------------------------------------------

[INFO] Total time: 01:13 min

[INFO] Finished at: 2019-11-20T17:06:39-03:00

[INFO] ------------------------------------------------------------------------

[ERROR] Failed to execute goal org.apache.maven.plugins:maven-surefire-plugin:3.0.0-M3:test (default-test) on project phoenicis-javafx: There are test failures.

[ERROR]

[ERROR] Please refer to /home/oiu7/.cache/pikaur/build/playonlinux5-git/src/playonlinux5/phoenicis-javafx/target/surefire-reports for the individual test results.

[ERROR] Please refer to dump files (if any exist) [date].dump, [date]-jvmRun[N].dump and [date].dumpstream.

[ERROR] -> [Help 1]

[ERROR]

[ERROR] To see the full stack trace of the errors, re-run Maven with the -e switch.

[ERROR] Re-run Maven using the -X switch to enable full debug logging.

[ERROR]

[ERROR] For more information about the errors and possible solutions, please read the following articles:

[ERROR] [Help 1] http://cwiki.apache.org/confluence/display/MAVEN/MojoFailureException

[ERROR]

[ERROR] After correcting the problems, you can resume the build with the command

[ERROR] mvn <args> -rf :phoenicis-javafx

==> ERROR: A failure occurred in build().

Aborting...

Command 'makepkg --force' failed to execute.

:: Try recovering?

[R] retry build

[p] PGP check skip

[c] checksums skip

[i] ignore architecture

[d] delete build dir and try again

[e] edit PKGBUILD


[s] skip building this package

[a] abort building all the packages

sanerb commented on 2019-09-16 08:52

getting some errors during build:

[ERROR] Failed to execute goal org.apache.maven.plugins:maven-compiler-plugin:3.8.1:compile (default-compile) on project phoenicis-configuration: Fatal error compiling: invalid flag: --release -> [Help 1]
[ERROR] 
[ERROR] To see the full stack trace of the errors, re-run Maven with the -e switch.
[ERROR] Re-run Maven using the -X switch to enable full debug logging.
[ERROR] 
[ERROR] For more information about the errors and possible solutions, please read the following articles:
[ERROR] 
[ERROR] After correcting the problems, you can resume the build with the command
[ERROR]   mvn <args> -rf :phoenicis-configuration
==> ERROR: A failure occurred in build().

torbido commented on 2019-01-13 07:52

It doesn't work!!!

[ERROR] Failed to execute goal org.apache.maven.plugins:maven-compiler-plugin:3.8.0:compile (default-compile) on project phoenicis-configuration: Fatal error compiling: invalid target release: 1.10 -> [Help 1] [ERROR]

[ERROR] To see the full stack trace of the errors, re-run Maven with the -e switch.

[ERROR] Re-run Maven using the -X switch to enable full debug logging. [ERROR]

[ERROR] For more information about the errors and possible solutions, please read the following articles:

[ERROR] [Help 1] http://cwiki.apache.org/confluence/display/MAVEN/MojoExecutionException [ERROR]

[ERROR] After correcting the problems, you can resume the build with the command [ERROR] mvn <goals> -rf :phoenicis-configuration

==> ERROR: A failure occurred in build(). Aborting...