Package Details: pidgin-remember-read-status 0.1.2-1

Git Clone URL: https://aur.archlinux.org/pidgin-remember-read-status.git (read-only, click to copy)
Package Base: pidgin-remember-read-status
Description: Pidgin plugin to remember which chats are unread when connecting to a chat room
Upstream URL: https://github.com/nablaa/pidgin-remember-read-status
Licenses: GPLv2
Submitter: nablaa
Maintainer: nablaa
Last Packager: nablaa
Votes: 1
Popularity: 0.000000
First Submitted: 2014-11-15 11:31
Last Updated: 2015-06-09 16:43

Latest Comments

dreieck commented on 2019-10-31 11:19

Fails to build for me:

In function ‘strncpy’,
    inlined from ‘chat_left_cb’ at /tmp/yaourt-tmp-felics/aur-pidgin-remember-read-status/src/pidgin-remember-read-status/src/remember_read_status.c:94:2,
    inlined from ‘conversation_updated_cb’ at /tmp/yaourt-tmp-felics/aur-pidgin-remember-read-status/src/pidgin-remember-read-status/src/remember_read_status.c:128:3:
/usr/include/bits/string_fortified.h:106:10: error: ‘__builtin_strncpy’ specified bound depends on the length of the source argument [-Werror=stringop-overflow=]
  106 |   return __builtin___strncpy_chk (__dest, __src, __len, __bos (__dest));
      |          ^~~~~~~~~~~~~~~~~~~~~~~~~~~~~~~~~~~~~~~~~~~~~~~~~~~~~~~~~~~~~~
/tmp/yaourt-tmp-felics/aur-pidgin-remember-read-status/src/pidgin-remember-read-status/src/remember_read_status.c: In function ‘conversation_updated_cb’:
/tmp/yaourt-tmp-felics/aur-pidgin-remember-read-status/src/pidgin-remember-read-status/src/remember_read_status.c:92:16: note: length computed here
   92 |  size_t size = strlen(conv_name) + 1;
      |                ^~~~~~~~~~~~~~~~~
In file included from /usr/include/string.h:494,
                 from /usr/include/glib-2.0/glib/gtestutils.h:30,
                 from /usr/include/glib-2.0/glib.h:85,
                 from /tmp/yaourt-tmp-felics/aur-pidgin-remember-read-status/src/pidgin-remember-read-status/src/remember_read_status.c:14:
In function ‘strncpy’,
    inlined from ‘get_history_filepath’ at /tmp/yaourt-tmp-felics/aur-pidgin-remember-read-status/src/pidgin-remember-read-status/src/remember_read_status.c:172:2,
    inlined from ‘plugin_load’ at /tmp/yaourt-tmp-felics/aur-pidgin-remember-read-status/src/pidgin-remember-read-status/src/remember_read_status.c:180:19:
/usr/include/bits/string_fortified.h:106:10: error: ‘__builtin_strncpy’ specified bound depends on the length of the source argument [-Werror=stringop-overflow=]
  106 |   return __builtin___strncpy_chk (__dest, __src, __len, __bos (__dest));
      |          ^~~~~~~~~~~~~~~~~~~~~~~~~~~~~~~~~~~~~~~~~~~~~~~~~~~~~~~~~~~~~~
/tmp/yaourt-tmp-felics/aur-pidgin-remember-read-status/src/pidgin-remember-read-status/src/remember_read_status.c: In function ‘plugin_load’:
/tmp/yaourt-tmp-felics/aur-pidgin-remember-read-status/src/pidgin-remember-read-status/src/remember_read_status.c:168:28: note: length computed here
  168 |  size_t directory_length = strlen(home_directory);
      |                            ^~~~~~~~~~~~~~~~~~~~~~
cc1: all warnings being treated as errors
make[2]: *** [src/CMakeFiles/remember_read_status.dir/build.make:63: src/CMakeFiles/remember_read_status.dir/remember_read_status.c.o] Error 1
make[1]: *** [CMakeFiles/Makefile2:128: src/CMakeFiles/remember_read_status.dir/all] Error 2
make: *** [Makefile:141: all] Error 2
==> ERROR: A failure occurred in build().
    Aborting...