Package Details: php73 7.3.27-1

Git Clone URL: (read-only, click to copy)
Package Base: php73
Description: A general-purpose scripting language that is especially suited to web development
Upstream URL:
Licenses: PHP
Conflicts: php73-ldap
Provides: php, php73-ldap=7.3.27
Replaces: php73-ldap
Submitter: matth
Maintainer: matth
Last Packager: matth
Votes: 8
Popularity: 0.030630
First Submitted: 2019-12-24 17:08
Last Updated: 2021-02-12 19:00

Required by (507)

Sources (9)

Latest Comments

1 2 3 4 Next › Last »

matth commented on 2021-02-28 18:02

brackenhill-mob I'm not sure what would be causing that error. The package builds just fine in a clean chroot for me using extra-x86_64-build

brackenhill-mob commented on 2021-02-28 17:04

I'm getting a build error in /home/arch/.cache/yay/php73/src/php-7.3.27/ext/fileinfo/libmagic/apprentice.c

    {standard input}: Assembler messages:
    {standard input}:3946: Warning: end of file not at end of a line; newline inserted
    {standard input}:5550: Error: no such instruction: `j'
    {standard input}: Error: open CFI at the end of file; missing .cfi_endproc directive
    cc: fatal error: Killed signal terminated program cc1
    compilation terminated.
    make: *** [Makefile:1011: ext/fileinfo/libmagic/apprentice.lo] Error 1
    ==> ERROR: A failure occurred in build().

Any chance of a fix? I'm migrating a invoicing package which is built against PHP7.3 from an Ubuntu server and my company needs this urgently


matth commented on 2021-01-14 21:21

@yolosan It looks like you don't have gpg configured to use a keyserver.

You can use something like

gpg --keyserver --receive-keys D66C9593118BCCB6

yolosan commented on 2021-01-14 12:15

Hi. I'm getting the following error:

==> Validating source files with sha256sums...
    php-7.3.26.tar.xz ... Passed
    php-7.3.26.tar.xz.asc ... Skipped
    apache.patch ... Passed
    apache.conf ... Passed
    php-fpm.patch ... Passed
    php-fpm.tmpfiles ... Passed
    php.ini.patch ... Passed
    enchant-2.patch ... Passed
    freetype.patch ... Passed
==> Verifying source file signatures with gpg...
    php-7.3.26.tar.xz ... FAILED (unknown public key D66C9593118BCCB6)
==> ERROR: One or more PGP signatures could not be verified!
:: Unable to build php73 - makepkg exited with code: 1


$ gpg --recv-key D66C9593118BCCB6
gpg: keyserver receive failed: No name

TheGoliath commented on 2020-05-02 15:48

Package also provides the php package itself. Should be added to the provides section

cdo commented on 2020-04-19 19:42

Thanks for this package. It builds perfectly fine on armv7h. Do you mind adding this architecture to the PKGBUILD?

berturion commented on 2020-03-09 09:51

Thank you @tompear, it is solved after rebuild.

tompear commented on 2020-03-09 07:18

Just rebuild php73-imagick. In most cases it will resolve the problem.

berturion commented on 2020-03-08 16:07

Just to let you know, since version upgrade of ImageMagick in the arch repo, I have this warning :

PHP Warning:  Version warning: Imagick was compiled against ImageMagick version 1801 but version 1802 is loaded. Imagick will run but may behave surprisingly

berturion commented on 2020-03-03 11:08

Ok, thank you @tompear, I did not understand, it is clear now :)