Package Details: php70-gd 7.0.33-4

Git Clone URL: (read-only, click to copy)
Package Base: php70
Description: gd module for PHP
Upstream URL:
Licenses: PHP
Provides: php70-gd=7.0.33
Submitter: betrixed
Maintainer: wget
Last Packager: wget
Votes: 10
Popularity: 0.000000
First Submitted: 2017-02-05 08:12
Last Updated: 2019-04-28 22:32

Pinned Comments

wget commented on 2018-04-24 22:41

This package makes use of GPG keys for integrity verification. Here are the PGP keys you need to import (if you trust them):

$ gpg --recv-keys 1A4E8B7277C42E53DBA9C7B9BCAA30EA9C0D5763 6E4F6AB321FDC07F2C332E3AC2BF0BC433CFC8B3

Receiving GPG keys might fail with the following error message: $ gpg: keyserver receive failed: Connection refused. If this happens, just check your DNS or use other ones.

Latest Comments

1 2 3 4 5 6 ... Next › Last »

el_aur commented on 2022-01-27 16:28

Hi guys. Wanna adopt this package. Have made universal builds for all PHP versions 5.3-8.1. Maintaining already php55, php72, php73, php74, php81 in AUR

el_aur commented on 2022-01-25 14:33

Have ported cve patches and Debian patches, can share here if you make me comaintainer :)

PetrP commented on 2021-12-12 13:07

To get this compile with libicu70, I used those two patches:

git apply <(wget -qO-
git apply <(wget -qO-

First is from rakotomandimby's comment bellow, second is slightly modified version of this patch from php72 NAlien's comment

rakotomandimby commented on 2021-09-30 20:39

Hi all,

I made a repo where:

  1. I tooked the snapshot
  2. I addressed the TRUE and FALSE undeclared issue
  3. I addressed the GD_FLIP_HORINZONTAL GD_FLIP_VERTICAL GD_FLIP_BOTH undeclared issue

Maintainer, feel free to get it at:

Users, you can just clone the repo and run "makepkg"

hamedsbt commented on 2021-08-25 04:14

@df8oe , I confirm solution by @reibeku (from php71 thread) it's working:

open PKGBUILD file and Replace:

build() {
    local phpConfig="\
        --srcdir=../${_pkgbase}-${pkgver} \
        --config-cache \


build() {
        export CC="gcc -DTRUE=1 -DFALSE=0"
        export CXX="g++ -DTRUE=1 -DFALSE=0"
    local phpConfig="\
        --srcdir=../${_pkgbase}-${pkgver} \
        --config-cache \

Thank you @reibeku

df8oe commented on 2021-04-29 06:29

I can confirm issue like @MrKMG reports - same for php71 packages.

MrKMG commented on 2021-03-15 18:53

I am getting the following errors while compiling with gcc version 10.2.0.

php-7.0.33/ext/intl/collator/collator_sort.c:347:26: error: ‘TRUE’ undeclared (first use in this function)
php-7.0.33/ext/intl/collator/collator_sort.c:541:26: error: ‘FALSE’ undeclared (first use in this function)

After some googling, it appears that nothing included contains #DEFINE TRUE or #DEFINE FALSE

Not sure what the appropriate way to address this is.

anxest commented on 2020-12-30 07:04

Looks like there is a new issue with icu:

php70 -v PHP Warning: PHP Startup: Unable to load dynamic library '/usr/lib/php70/modules/' - cannot open shared object file: No such file or directory in Unknown on line 0 PHP 7.0.33 (cli) (built: Sep 3 2020 05:45:19) ( NTS )

Building also fails on both of my arch computers:

make: *** [Makefile:1135 : ext/intl/collator/collator_sort.lo] Erreur 1 ==> ERREUR : Une erreur s’est produite dans build().

I couldn't find a solution so far, but still looking

contreras.joseja commented on 2020-07-31 16:14

$ gpg --keyserver hkp:// --recv-keys 1A4E8B7277C42E53DBA9C7B9BCAA30EA9C0D5763 6E4F6AB321FDC07F2C332E3AC2BF0BC433CFC8B3

wget commented on 2019-09-15 14:49

@gchamon I haven't been able to reproduce the problem. Could you test on a fresh ArchLinux VM?